{"text_format":"1","workbook":"xlsx","n_sheets":26,"sheets":["INDICE","Cuenta de resultados","Balances consolidados","Actividad bancaria en España","Actividad inm. en España","Riesgo promoción inmobiliaria","Estados Unidos","Turquía","México","América del sur","Argentina","Chile","Colombia","Perú","Venezuela","AdS_sinVenezuela","Resto de Eurasia","Centro Corporativo","Grupo BBVA sin V ","Corporate & Investment Banking","Eficiencia","Mora,cobertura,prima de riesgo","Empleados,oficinas y cajeros","Tipos de cambio","Rendimientos y costes","Nombres"],"not_rendered":{"charts":0,"images":1,"macros":1,"external_links":10,"defined_names":112,"comments":0,"pivot_tables":0},"unopened":[],"bounds":{"document_bytes":16777216,"sheet_cells":100000,"rows_first":2000,"rows_last":500,"rows_between":2000,"halvings":0,"cell_chars":16384,"cell_head_chars":4096},"cells_cut":0,"cells_raw":0,"read":"whole","date_system":"1900"}

{"sheet":"INDICE","index":0,"n_rows":33,"n_cols":6,"rows_kept":33,"cut":false,"hidden":false,"merged":[]}
[]
[null,null,{"$f":"HLOOKUP($F$2,Nombres!$C$3:$E$853,192)","v":"Quarterly series 2014-2015 "},null,null,1]
[]
[null,null,{"$f":"HLOOKUP($F$2,Nombres!$C$3:$E$853,200)","v":"BBVA Group"},{"$f":"HLOOKUP($F$2,Nombres!$C$3:$E$853,263)","v":"Print"},false]
[null,null,{"$f":"HLOOKUP($F$2,Nombres!$C$3:$E$853,267)","v":"Consolidated income statement"},null,false,{"$f":"OR($E$4,E5)","v":false}]
[null,null,{"$f":"HLOOKUP($F$2,Nombres!$C$3:$E$853,196)","v":"Consolidated balance sheet"},null,false,{"$f":"OR($E$4,E6)","v":false}]
{"$rows_left_out":28}
{"sheet":"Cuenta de resultados","index":1,"n_rows":61,"n_cols":7,"rows_kept":61,"cut":false,"hidden":false,"merged":[[60,0,60,6],[28,0,28,6],[29,0,29,6],[2,1,2,4],[2,5,2,6],[32,1,32,4],[32,5,32,6],[59,0,59,6]]}
[{"$f":"HLOOKUP(INDICE!$F$2,Nombres!$C$3:$E$853,290)","v":"Consolidated income statement (*)"}]
[{"$f":"HLOOKUP(INDICE!$F$2,Nombres!$C$3:$E$853,30)","v":"(Million euros)"}]
[null,2014,null,null,null,2015]
[null,{"$f":"HLOOKUP(INDICE!$F$2,Nombres!$C$3:$E$857,34)","v":"1st Quarter"},{"$f":"HLOOKUP(INDICE!$F$2,Nombres!$C$3:$E$857,35)","v":"2nd Quarter"},{"$f":"HLOOKUP(INDICE!$F$2,Nombres!$C$3:$E$857,36)","v":"3rd Quarter"},{"$f":"HLOOKUP(INDICE!$F$2,Nombres!$C$3:$E$857,37)","v":"4th Quarter"},{"$f":"HLOOKUP(INDICE!$F$2,Nombres!$C$3:$E$857,34)","v":"1st Quarter"},{"$f":"HLOOKUP(INDICE!$F$2,Nombres!$C$3:$E$857,35)","v":"2nd Quarter"}]
[{"$f":"HLOOKUP(INDICE!$F$2,Nombres!$C$3:$E$853,38)","v":"Net interest income"},3390.5869999999995,3647.451,3829.9220000000005,4248.2979999999998,3662.9660000000003,3857.7450000099998]
[{"$f":"HLOOKUP(INDICE!$F$2,Nombres!$C$3:$E$853,39)","v":"Net fees and commissions"},985.17599999999993,1101.174,1111.2639999999999,1167.566,1076.7649999999999,1139.6320000000001]
{"$rows_left_out":56}
{"sheet":"Balances consolidados","index":2,"n_rows":78,"n_cols":7,"rows_kept":78,"cut":false,"hidden":false,"merged":[]}
[{"$f":"HLOOKUP(INDICE!$F$2,Nombres!$C$3:$E$853,291)","v":"BBVA Group. Consolidated balance sheet (*)"}]
[{"$f":"HLOOKUP(INDICE!F2,Nombres!$C$3:$E$853,30)","v":"(Million euros)"}]
[]
[null,"2014-03-31","2014-06-30","2014-09-30","2014-12-31","2015-03-31","2015-06-30"]
[]
[{"$f":"HLOOKUP(INDICE!F2,Nombres!$C$3:$E$853,63)","v":"Cash and balances with central banks"},27546.094000000001,27210.223000000002,23120.532999999999,33908.392999999996,27553.317999999999,30192.351999999999]
{"$rows_left_out":73}
{"sheet":"Actividad bancaria en España","index":3,"n_rows":51,"n_cols":7,"rows_kept":51,"cut":false,"hidden":false,"merged":[[3,1,3,4],[3,5,3,6]]}
[{"$f":"HLOOKUP(INDICE!$F$2,Nombres!$C$3:$E$853,301)","v":"Banking activity in Spain"}]
[{"$f":"HLOOKUP(INDICE!$F$2,Nombres!$C$3:$E$853,93)","v":"Income statement  "}]
[{"$f":"HLOOKUP(INDICE!$F$2,Nombres!$C$3:$E$853,30)","v":"(Million euros)"}]
[null,2014,null,null,null,2015]
[null,{"$f":"HLOOKUP(INDICE!$F$2,Nombres!$C$3:$E$857,34)","v":"1st Quarter"},{"$f":"HLOOKUP(INDICE!$F$2,Nombres!$C$3:$E$857,35)","v":"2nd Quarter"},{"$f":"HLOOKUP(INDICE!$F$2,Nombres!$C$3:$E$857,36)","v":"3rd Quarter"},{"$f":"HLOOKUP(INDICE!$F$2,Nombres!$C$3:$E$857,37)","v":"4th Quarter"},{"$f":"HLOOKUP(INDICE!$F$2,Nombres!$C$3:$E$857,34)","v":"1st Quarter"},{"$f":"HLOOKUP(INDICE!$F$2,Nombres!$C$3:$E$857,35)","v":"2nd Quarter"}]
[{"$f":"HLOOKUP(INDICE!$F$2,Nombres!$C$3:$E$853,38)","v":"Net interest income"},930.96706586999994,937.72312753000006,965.53561285000001,995.90663482000014,967.68306816999996,1014.4287571300001]
{"$rows_left_out":46}
{"sheet":"Actividad inm. en España","index":4,"n_rows":43,"n_cols":7,"rows_kept":43,"cut":false,"hidden":false,"merged":[[3,1,3,4],[3,5,3,6]]}
[{"$f":"HLOOKUP(INDICE!$F$2,Nombres!$C$3:$E$853,279)","v":"Real-estate business in Spain"}]
[{"$f":"HLOOKUP(INDICE!$F$2,Nombres!$C$3:$E$853,93)","v":"Income statement  "}]
[{"$f":"HLOOKUP(INDICE!$F$2,Nombres!$C$3:$E$853,30)","v":"(Million euros)"}]
[null,2014,null,null,null,2015]
[null,{"$f":"HLOOKUP(INDICE!$F$2,Nombres!$C$3:$E$857,34)","v":"1st Quarter"},{"$f":"HLOOKUP(INDICE!$F$2,Nombres!$C$3:$E$857,35)","v":"2nd Quarter"},{"$f":"HLOOKUP(INDICE!$F$2,Nombres!$C$3:$E$857,36)","v":"3rd Quarter"},{"$f":"HLOOKUP(INDICE!$F$2,Nombres!$C$3:$E$857,37)","v":"4th Quarter"},{"$f":"HLOOKUP(INDICE!$F$2,Nombres!$C$3:$E$857,34)","v":"1st Quarter"},{"$f":"HLOOKUP(INDICE!$F$2,Nombres!$C$3:$E$857,35)","v":"2nd Quarter"}]
[{"$f":"HLOOKUP(INDICE!$F$2,Nombres!$C$3:$E$853,38)","v":"Net interest income"},-7.3170118699999982,-14.30579127,-8.7484138399999996,-8.0659005099999987,-9.4670519600000009,-4.5765528399999997]
{"$rows_left_out":38}
{"sheet":"Riesgo promoción inmobiliaria","index":5,"n_rows":20,"n_cols":4,"rows_kept":20,"cut":false,"hidden":false,"merged":[]}
[{"$f":"HLOOKUP(INDICE!$F$2,Nombres!$C$3:$E$853,262)","v":"Coverage of real estate exposure in Spain"}]
[{"$f":"HLOOKUP(INDICE!$F$2,Nombres!$C$3:$E$853,243)","v":"(Million of euros as of 30-Jun-15)"}]
[]
[]
[null,{"$f":"HLOOKUP(INDICE!$F$2,Nombres!$C$3:$E$853,244)","v":"Risk amount"},{"$f":"HLOOKUP(INDICE!$F$2,Nombres!$C$3:$E$853,245)","v":"Provision"},{"$f":"HLOOKUP(INDICE!$F$2,Nombres!$C$3:$E$853,246)","v":"% Coverage over risk"}]
[{"$f":"HLOOKUP(INDICE!$F$2,Nombres!$C$3:$E$853,247)","v":"NPL + Substandard"},8212,4533,55.199707744763757]
{"$rows_left_out":15}
{"sheet":"Estados Unidos","index":6,"n_rows":102,"n_cols":7,"rows_kept":102,"cut":false,"hidden":false,"merged":[[3,1,3,4],[3,5,3,6],[53,1,53,4],[53,5,53,6]]}
[{"$f":"HLOOKUP(INDICE!$F$2,Nombres!$C$3:$E$853,20)","v":"The United States"}]
[{"$f":"HLOOKUP(INDICE!$F$2,Nombres!$C$3:$E$853,93)","v":"Income statement  "}]
[{"$f":"HLOOKUP(INDICE!$F$2,Nombres!$C$3:$E$853,30)","v":"(Million euros)"}]
[null,2014,null,null,null,2015]
[null,{"$f":"HLOOKUP(INDICE!$F$2,Nombres!$C$3:$E$857,34)","v":"1st Quarter"},{"$f":"HLOOKUP(INDICE!$F$2,Nombres!$C$3:$E$857,35)","v":"2nd Quarter"},{"$f":"HLOOKUP(INDICE!$F$2,Nombres!$C$3:$E$857,36)","v":"3rd Quarter"},{"$f":"HLOOKUP(INDICE!$F$2,Nombres!$C$3:$E$857,37)","v":"4th Quarter"},{"$f":"HLOOKUP(INDICE!$F$2,Nombres!$C$3:$E$857,34)","v":"1st Quarter"},{"$f":"HLOOKUP(INDICE!$F$2,Nombres!$C$3:$E$857,35)","v":"2nd Quarter"}]
[{"$f":"HLOOKUP(INDICE!$F$2,Nombres!$C$3:$E$853,38)","v":"Net interest income"},345.34143186,347.26771948999999,361.74554666,388.56140845000004,434.9317504,446.46030080000003]
{"$rows_left_out":97}
{"sheet":"Turquía","index":7,"n_rows":101,"n_cols":7,"rows_kept":101,"cut":false,"hidden":false,"merged":[[72,0,72,6],[91,0,91,6],[3,1,3,4],[3,5,3,6],[52,1,52,4],[52,5,52,6],[23,0,23,6],[41,0,41,6]]}
[{"$f":"HLOOKUP(INDICE!$F$2,Nombres!$C$3:$E$853,295)","v":"Turkey"}]
[{"$f":"HLOOKUP(INDICE!$F$2,Nombres!$C$3:$E$853,304)","v":"Income statement (*)"}]
[{"$f":"HLOOKUP(INDICE!$F$2,Nombres!$C$3:$E$853,30)","v":"(Million euros)"}]
[null,2014,null,null,null,2015]
[null,{"$f":"HLOOKUP(INDICE!$F$2,Nombres!$C$3:$E$857,34)","v":"1st Quarter"},{"$f":"HLOOKUP(INDICE!$F$2,Nombres!$C$3:$E$857,35)","v":"2nd Quarter"},{"$f":"HLOOKUP(INDICE!$F$2,Nombres!$C$3:$E$857,36)","v":"3rd Quarter"},{"$f":"HLOOKUP(INDICE!$F$2,Nombres!$C$3:$E$857,37)","v":"4th Quarter"},{"$f":"HLOOKUP(INDICE!$F$2,Nombres!$C$3:$E$857,34)","v":"1st Quarter"},{"$f":"HLOOKUP(INDICE!$F$2,Nombres!$C$3:$E$857,35)","v":"2nd Quarter"}]
[{"$f":"HLOOKUP(INDICE!$F$2,Nombres!$C$3:$E$853,38)","v":"Net interest income"},146.34886950000001,167.27188501000001,196.55727318000001,224.46315089000001,210.40501202999999,214.60152532000001]
{"$rows_left_out":96}
{"sheet":"México","index":8,"n_rows":99,"n_cols":7,"rows_kept":99,"cut":false,"hidden":false,"merged":[[3,1,3,4],[3,5,3,6],[51,1,51,4],[51,5,51,6]]}
[{"$f":"HLOOKUP(INDICE!$F$2,Nombres!$C$3:$E$853,9)","v":"Mexico"}]
[{"$f":"HLOOKUP(INDICE!$F$2,Nombres!$C$3:$E$853,93)","v":"Income statement  "}]
[{"$f":"HLOOKUP(INDICE!$F$2,Nombres!$C$3:$E$853,30)","v":"(Million euros)"}]
[null,2014,null,null,null,2015]
[null,{"$f":"HLOOKUP(INDICE!$F$2,Nombres!$C$3:$E$857,34)","v":"1st Quarter"},{"$f":"HLOOKUP(INDICE!$F$2,Nombres!$C$3:$E$857,35)","v":"2nd Quarter"},{"$f":"HLOOKUP(INDICE!$F$2,Nombres!$C$3:$E$857,36)","v":"3rd Quarter"},{"$f":"HLOOKUP(INDICE!$F$2,Nombres!$C$3:$E$857,37)","v":"4th Quarter"},{"$f":"HLOOKUP(INDICE!$F$2,Nombres!$C$3:$E$857,34)","v":"1st Quarter"},{"$f":"HLOOKUP(INDICE!$F$2,Nombres!$C$3:$E$857,35)","v":"2nd Quarter"}]
[{"$f":"HLOOKUP(INDICE!$F$2,Nombres!$C$3:$E$853,38)","v":"Net interest income"},1172.6951419100001,1181.3981738299999,1232.7636235499999,1323.55857971,1340.3771765199999,1393.4643517]
{"$rows_left_out":94}
{"sheet":"América del sur","index":9,"n_rows":99,"n_cols":7,"rows_kept":99,"cut":false,"hidden":false,"merged":[[3,1,3,4],[3,5,3,6],[51,1,51,4],[51,5,51,6]]}
[{"$f":"HLOOKUP(INDICE!$F$2,Nombres!$C$3:$E$853,12)","v":"South America"}]
[{"$f":"HLOOKUP(INDICE!$F$2,Nombres!$C$3:$E$853,93)","v":"Income statement  "}]
[{"$f":"HLOOKUP(INDICE!$F$2,Nombres!$C$3:$E$853,30)","v":"(Million euros)"}]
[null,2014,null,null,null,2015]
[null,{"$f":"HLOOKUP(INDICE!$F$2,Nombres!$C$3:$E$857,34)","v":"1st Quarter"},{"$f":"HLOOKUP(INDICE!$F$2,Nombres!$C$3:$E$857,35)","v":"2nd Quarter"},{"$f":"HLOOKUP(INDICE!$F$2,Nombres!$C$3:$E$857,36)","v":"3rd Quarter"},{"$f":"HLOOKUP(INDICE!$F$2,Nombres!$C$3:$E$857,37)","v":"4th Quarter"},{"$f":"HLOOKUP(INDICE!$F$2,Nombres!$C$3:$E$857,34)","v":"1st Quarter"},{"$f":"HLOOKUP(INDICE!$F$2,Nombres!$C$3:$E$857,35)","v":"2nd Quarter"}]
[{"$f":"HLOOKUP(INDICE!$F$2,Nombres!$C$3:$E$853,38)","v":"Net interest income"},933.74738524000009,1126.8441222399999,1203.59736935,1434.3155633599999,801.96296129999996,850.37569377]
{"$rows_left_out":94}
{"sheet":"Argentina","index":10,"n_rows":99,"n_cols":7,"rows_kept":99,"cut":false,"hidden":false,"merged":[[3,1,3,4],[3,5,3,6],[51,1,51,4],[51,5,51,6]]}
[{"$f":"HLOOKUP(INDICE!$F$2,Nombres!$C$3:$E$853,15)","v":"Argentina"}]
[{"$f":"HLOOKUP(INDICE!$F$2,Nombres!$C$3:$E$853,93)","v":"Income statement  "}]
[{"$f":"HLOOKUP(INDICE!$F$2,Nombres!$C$3:$E$853,30)","v":"(Million euros)"}]
[null,2014,null,null,null,2015]
[null,{"$f":"HLOOKUP(INDICE!$F$2,Nombres!$C$3:$E$857,34)","v":"1st Quarter"},{"$f":"HLOOKUP(INDICE!$F$2,Nombres!$C$3:$E$857,35)","v":"2nd Quarter"},{"$f":"HLOOKUP(INDICE!$F$2,Nombres!$C$3:$E$857,36)","v":"3rd Quarter"},{"$f":"HLOOKUP(INDICE!$F$2,Nombres!$C$3:$E$857,37)","v":"4th Quarter"},{"$f":"HLOOKUP(INDICE!$F$2,Nombres!$C$3:$E$857,34)","v":"1st Quarter"},{"$f":"HLOOKUP(INDICE!$F$2,Nombres!$C$3:$E$857,35)","v":"2nd Quarter"}]
[{"$f":"HLOOKUP(INDICE!$F$2,Nombres!$C$3:$E$853,38)","v":"Net interest income"},125.44400015000001,137.81756781999999,160.00803138000001,183.97694009000003,202.79400002,212.67900044000004]
{"$rows_left_out":94}
{"sheet":"Chile","index":11,"n_rows":99,"n_cols":7,"rows_kept":99,"cut":false,"hidden":false,"merged":[[3,1,3,4],[3,5,3,6],[51,1,51,4],[51,5,51,6]]}
[{"$f":"HLOOKUP(INDICE!$F$2,Nombres!$C$3:$E$853,16)","v":"Chile"}]
[{"$f":"HLOOKUP(INDICE!$F$2,Nombres!$C$3:$E$853,93)","v":"Income statement  "}]
[{"$f":"HLOOKUP(INDICE!$F$2,Nombres!$C$3:$E$853,30)","v":"(Million euros)"}]
[null,2014,null,null,null,2015]
[null,{"$f":"HLOOKUP(INDICE!$F$2,Nombres!$C$3:$E$857,34)","v":"1st Quarter"},{"$f":"HLOOKUP(INDICE!$F$2,Nombres!$C$3:$E$857,35)","v":"2nd Quarter"},{"$f":"HLOOKUP(INDICE!$F$2,Nombres!$C$3:$E$857,36)","v":"3rd Quarter"},{"$f":"HLOOKUP(INDICE!$F$2,Nombres!$C$3:$E$857,37)","v":"4th Quarter"},{"$f":"HLOOKUP(INDICE!$F$2,Nombres!$C$3:$E$857,34)","v":"1st Quarter"},{"$f":"HLOOKUP(INDICE!$F$2,Nombres!$C$3:$E$857,35)","v":"2nd Quarter"}]
[{"$f":"HLOOKUP(INDICE!$F$2,Nombres!$C$3:$E$853,38)","v":"Net interest income"},124.06399994,131.76700037000001,114.75999903,141.61800073000001,119.18100007999999,141.74200045000001]
{"$rows_left_out":94}
{"sheet":"Colombia","index":12,"n_rows":99,"n_cols":7,"rows_kept":99,"cut":false,"hidden":false,"merged":[[3,1,3,4],[3,5,3,6],[51,1,51,4],[51,5,51,6]]}
[{"$f":"HLOOKUP(INDICE!$F$2,Nombres!$C$3:$E$853,17)","v":"Colombia"}]
[{"$f":"HLOOKUP(INDICE!$F$2,Nombres!$C$3:$E$853,93)","v":"Income statement  "}]
[{"$f":"HLOOKUP(INDICE!$F$2,Nombres!$C$3:$E$853,30)","v":"(Million euros)"}]
[null,2014,null,null,null,2015]
[null,{"$f":"HLOOKUP(INDICE!$F$2,Nombres!$C$3:$E$857,34)","v":"1st Quarter"},{"$f":"HLOOKUP(INDICE!$F$2,Nombres!$C$3:$E$857,35)","v":"2nd Quarter"},{"$f":"HLOOKUP(INDICE!$F$2,Nombres!$C$3:$E$857,36)","v":"3rd Quarter"},{"$f":"HLOOKUP(INDICE!$F$2,Nombres!$C$3:$E$857,37)","v":"4th Quarter"},{"$f":"HLOOKUP(INDICE!$F$2,Nombres!$C$3:$E$857,34)","v":"1st Quarter"},{"$f":"HLOOKUP(INDICE!$F$2,Nombres!$C$3:$E$857,35)","v":"2nd Quarter"}]
[{"$f":"HLOOKUP(INDICE!$F$2,Nombres!$C$3:$E$853,38)","v":"Net interest income"},181.29299985,197.30700003000001,201.58499968000001,202.14399989999998,201.23500084,201.65216625000002]
{"$rows_left_out":94}
{"sheet":"Perú","index":13,"n_rows":99,"n_cols":7,"rows_kept":99,"cut":false,"hidden":false,"merged":[[3,1,3,4],[3,5,3,6],[51,1,51,4],[51,5,51,6]]}
[{"$f":"HLOOKUP(INDICE!$F$2,Nombres!$C$3:$E$853,18)","v":"Peru"}]
[{"$f":"HLOOKUP(INDICE!$F$2,Nombres!$C$3:$E$853,93)","v":"Income statement  "}]
[{"$f":"HLOOKUP(INDICE!$F$2,Nombres!$C$3:$E$853,30)","v":"(Million euros)"}]
[null,2014,null,null,null,2015]
[null,{"$f":"HLOOKUP(INDICE!$F$2,Nombres!$C$3:$E$857,34)","v":"1st Quarter"},{"$f":"HLOOKUP(INDICE!$F$2,Nombres!$C$3:$E$857,35)","v":"2nd Quarter"},{"$f":"HLOOKUP(INDICE!$F$2,Nombres!$C$3:$E$857,36)","v":"3rd Quarter"},{"$f":"HLOOKUP(INDICE!$F$2,Nombres!$C$3:$E$857,37)","v":"4th Quarter"},{"$f":"HLOOKUP(INDICE!$F$2,Nombres!$C$3:$E$857,34)","v":"1st Quarter"},{"$f":"HLOOKUP(INDICE!$F$2,Nombres!$C$3:$E$857,35)","v":"2nd Quarter"}]
[{"$f":"HLOOKUP(INDICE!$F$2,Nombres!$C$3:$E$853,38)","v":"Net interest income"},166.85599969,171.48941416,177.25961470999999,185.02180048,189.05080909999998,191.35578784999998]
{"$rows_left_out":94}
{"sheet":"Venezuela","index":14,"n_rows":99,"n_cols":7,"rows_kept":99,"cut":false,"hidden":false,"merged":[[3,1,3,4],[3,5,3,6],[51,1,51,4],[51,5,51,6]]}
[{"$f":"HLOOKUP(INDICE!$F$2,Nombres!$C$3:$E$853,19)","v":"Venezuela"}]
[{"$f":"HLOOKUP(INDICE!$F$2,Nombres!$C$3:$E$853,93)","v":"Income statement  "}]
[{"$f":"HLOOKUP(INDICE!$F$2,Nombres!$C$3:$E$853,30)","v":"(Million euros)"}]
[null,2014,null,null,null,2015]
[null,{"$f":"HLOOKUP(INDICE!$F$2,Nombres!$C$3:$E$857,34)","v":"1st Quarter"},{"$f":"HLOOKUP(INDICE!$F$2,Nombres!$C$3:$E$857,35)","v":"2nd Quarter"},{"$f":"HLOOKUP(INDICE!$F$2,Nombres!$C$3:$E$857,36)","v":"3rd Quarter"},{"$f":"HLOOKUP(INDICE!$F$2,Nombres!$C$3:$E$857,37)","v":"4th Quarter"},{"$f":"HLOOKUP(INDICE!$F$2,Nombres!$C$3:$E$857,34)","v":"1st Quarter"},{"$f":"HLOOKUP(INDICE!$F$2,Nombres!$C$3:$E$857,35)","v":"2nd Quarter"}]
[{"$f":"HLOOKUP(INDICE!$F$2,Nombres!$C$3:$E$853,38)","v":"Net interest income"},293.15199927999998,447.22900023,508.32299983999997,676.2730004,38.962999400000001,54.946001279999997]
{"$rows_left_out":94}
{"sheet":"AdS_sinVenezuela","index":15,"n_rows":99,"n_cols":7,"rows_kept":99,"cut":false,"hidden":false,"merged":[[3,1,3,4],[3,5,3,6],[51,1,51,4],[51,5,51,6]]}
[{"$f":"HLOOKUP(INDICE!$F$2,Nombres!$C$3:$E$853,305)","v":"South America without Venezuela"}]
[{"$f":"HLOOKUP(INDICE!$F$2,Nombres!$C$3:$E$853,93)","v":"Income statement  "}]
[{"$f":"HLOOKUP(INDICE!$F$2,Nombres!$C$3:$E$853,30)","v":"(Million euros)"}]
[null,2014,null,null,null,2015]
[null,{"$f":"HLOOKUP(INDICE!$F$2,Nombres!$C$3:$E$857,34)","v":"1st Quarter"},{"$f":"HLOOKUP(INDICE!$F$2,Nombres!$C$3:$E$857,35)","v":"2nd Quarter"},{"$f":"HLOOKUP(INDICE!$F$2,Nombres!$C$3:$E$857,36)","v":"3rd Quarter"},{"$f":"HLOOKUP(INDICE!$F$2,Nombres!$C$3:$E$857,37)","v":"4th Quarter"},{"$f":"HLOOKUP(INDICE!$F$2,Nombres!$C$3:$E$857,34)","v":"1st Quarter"},{"$f":"HLOOKUP(INDICE!$F$2,Nombres!$C$3:$E$857,35)","v":"2nd Quarter"}]
[{"$f":"HLOOKUP(INDICE!$F$2,Nombres!$C$3:$E$853,38)","v":"Net interest income"},640.59538595999993,679.61512201000005,695.27436951000004,758.04256295999994,762.99996190000002,795.42969249000009]
{"$rows_left_out":94}
{"sheet":"Resto de Eurasia","index":16,"n_rows":52,"n_cols":7,"rows_kept":52,"cut":false,"hidden":false,"merged":[[3,1,3,4],[3,5,3,6]]}
[{"$f":"HLOOKUP(INDICE!$F$2,Nombres!$C$3:$E$853,184)","v":"Rest of Eurasia"}]
[{"$f":"HLOOKUP(INDICE!$F$2,Nombres!$C$3:$E$853,93)","v":"Income statement  "}]
[{"$f":"HLOOKUP(INDICE!$F$2,Nombres!$C$3:$E$853,30)","v":"(Million euros)"}]
[null,2014,null,null,null,2015]
[null,{"$f":"HLOOKUP(INDICE!$F$2,Nombres!$C$3:$E$857,34)","v":"1st Quarter"},{"$f":"HLOOKUP(INDICE!$F$2,Nombres!$C$3:$E$857,35)","v":"2nd Quarter"},{"$f":"HLOOKUP(INDICE!$F$2,Nombres!$C$3:$E$857,36)","v":"3rd Quarter"},{"$f":"HLOOKUP(INDICE!$F$2,Nombres!$C$3:$E$857,37)","v":"4th Quarter"},{"$f":"HLOOKUP(INDICE!$F$2,Nombres!$C$3:$E$857,34)","v":"1st Quarter"},{"$f":"HLOOKUP(INDICE!$F$2,Nombres!$C$3:$E$857,35)","v":"2nd Quarter"}]
[{"$f":"HLOOKUP(INDICE!$F$2,Nombres!$C$3:$E$853,38)","v":"Net interest income"},47.334717870000006,47.798718519999994,49.94009346,43.789860579999996,46.316785299999992,38.986556489999998]
{"$rows_left_out":47}
{"sheet":"Centro Corporativo","index":17,"n_rows":52,"n_cols":7,"rows_kept":52,"cut":false,"hidden":false,"merged":[[6,1,6,4],[6,5,6,6]]}
[{"$f":"HLOOKUP(INDICE!$F$2,Nombres!$C$3:$E$853,25)","v":"Corporate Center "}]
[]
[]
[{"$f":"HLOOKUP(INDICE!$F$2,Nombres!$C$3:$E$853,93)","v":"Income statement  "}]
[{"$f":"HLOOKUP(INDICE!$F$2,Nombres!$C$3:$E$853,30)","v":"(Million euros)"}]
[]
{"$rows_left_out":47}
{"sheet":"Grupo BBVA sin V ","index":18,"n_rows":61,"n_cols":7,"rows_kept":61,"cut":false,"hidden":false,"merged":[[59,0,59,6],[60,0,60,6],[2,1,2,4],[2,5,2,6],[32,1,32,4],[32,5,32,6],[28,0,28,6],[29,0,29,6]]}
[{"$f":"HLOOKUP(INDICE!$F$2,Nombres!$C$3:$E$853,303)","v":"BBVA Group without Venezuela"}]
[{"$f":"HLOOKUP(INDICE!$F$2,Nombres!$C$3:$E$853,30)","v":"(Million euros)"}]
[null,2014,null,null,null,2015]
[null,{"$f":"HLOOKUP(INDICE!$F$2,Nombres!$C$3:$E$857,34)","v":"1st Quarter"},{"$f":"HLOOKUP(INDICE!$F$2,Nombres!$C$3:$E$857,35)","v":"2nd Quarter"},{"$f":"HLOOKUP(INDICE!$F$2,Nombres!$C$3:$E$857,36)","v":"3rd Quarter"},{"$f":"HLOOKUP(INDICE!$F$2,Nombres!$C$3:$E$857,37)","v":"4th Quarter"},{"$f":"HLOOKUP(INDICE!$F$2,Nombres!$C$3:$E$857,34)","v":"1st Quarter"},{"$f":"HLOOKUP(INDICE!$F$2,Nombres!$C$3:$E$857,35)","v":"2nd Quarter"}]
[{"$f":"HLOOKUP(INDICE!$F$2,Nombres!$C$3:$E$853,38)","v":"Net interest income"},3097.4350007200001,3200.2219997699999,3321.5990001600003,3572.0249996000002,3624.0030005999997,3802.7989987299998]
[{"$f":"HLOOKUP(INDICE!$F$2,Nombres!$C$3:$E$853,39)","v":"Net fees and commissions"},948.19599996000011,1033.99240887,1027.89817625,1051.93403999,1070.5990007099999,1131.35400164]
{"$rows_left_out":56}
{"sheet":"Corporate & Investment Banking","index":19,"n_rows":102,"n_cols":7,"rows_kept":102,"cut":false,"hidden":false,"merged":[[3,1,3,4],[3,5,3,6],[53,1,53,4],[53,5,53,6]]}
[{"$f":"HLOOKUP(INDICE!$F$2,Nombres!$C$3:$E$853,186)","v":"Corporate & Investment Banking"}]
[{"$f":"HLOOKUP(INDICE!$F$2,Nombres!$C$3:$E$853,93)","v":"Income statement  "}]
[{"$f":"HLOOKUP(INDICE!$F$2,Nombres!$C$3:$E$853,30)","v":"(Million euros)"}]
[null,2014,null,null,null,2015]
[null,{"$f":"HLOOKUP(INDICE!$F$2,Nombres!$C$3:$E$857,34)","v":"1st Quarter"},{"$f":"HLOOKUP(INDICE!$F$2,Nombres!$C$3:$E$857,35)","v":"2nd Quarter"},{"$f":"HLOOKUP(INDICE!$F$2,Nombres!$C$3:$E$857,36)","v":"3rd Quarter"},{"$f":"HLOOKUP(INDICE!$F$2,Nombres!$C$3:$E$857,37)","v":"4th Quarter"},{"$f":"HLOOKUP(INDICE!$F$2,Nombres!$C$3:$E$857,34)","v":"1st Quarter"},{"$f":"HLOOKUP(INDICE!$F$2,Nombres!$C$3:$E$857,35)","v":"2nd Quarter"}]
[{"$f":"HLOOKUP(INDICE!$F$2,Nombres!$C$3:$E$853,38)","v":"Net interest income"},369.56927440999999,381.63450563999999,381.67995410000003,381.89151240000001,341.74580070000002,361.24870156999998]
{"$rows_left_out":97}
{"sheet":"Eficiencia","index":20,"n_rows":20,"n_cols":7,"rows_kept":20,"cut":false,"hidden":false,"merged":[]}
[{"$f":"HLOOKUP(INDICE!$F$2,Nombres!$C$3:$E$853,138)","v":"Efficiency (%) (*)"}]
[]
[null,"2014-03-31","2014-06-30","2014-09-30","2014-12-31","2015-03-31","2015-06-30"]
[]
[{"$f":"HLOOKUP(INDICE!$F$2,Nombres!$C$3:$E$853,164)","v":"BBVA Group"},51.732213640045245,50.878139531474375,51.601932637580042,51.276438067999116,49.279639500158012,49.485694611480362]
[]
{"$rows_left_out":15}
{"sheet":"Mora,cobertura,prima de riesgo","index":21,"n_rows":55,"n_cols":7,"rows_kept":55,"cut":false,"hidden":false,"merged":[]}
[{"$f":"HLOOKUP(INDICE!$F$2,Nombres!$C$3:$E$853,139)","v":"NPA ratio (%)"}]
[]
[null,"2014-03-31","2014-06-30","2014-09-30","2014-12-31","2015-03-31","2015-06-30"]
[]
[{"$f":"HLOOKUP(INDICE!$F$2,Nombres!$C$3:$E$853,164)","v":"BBVA Group"},6.6000000000000003E-2,6.4000000000000001E-2,6.0999999999999999E-2,5.8000000000000003E-2,5.6000000000000001E-2,6.0999999999999999E-2]
[]
{"$rows_left_out":50}
{"sheet":"Empleados,oficinas y cajeros","index":22,"n_rows":51,"n_cols":7,"rows_kept":51,"cut":false,"hidden":false,"merged":[]}
[{"$f":"HLOOKUP(INDICE!$F$2,Nombres!$C$3:$F$853,141)","v":"Branches"}]
[null,"2014-03-31","2014-06-30","2014-09-30","2014-12-31","2015-03-31","2015-06-30"]
[{"$f":"HLOOKUP(INDICE!$F$2,Nombres!$C$3:$F$853,142)","v":"Spain"},3231,3137,3131,3112,3111,3869]
[{"$f":"HLOOKUP(INDICE!$F$2,Nombres!$C$3:$E$853,184)","v":"Rest of Eurasia"},117,117,118,75,75,75]
[{"$f":"HLOOKUP(INDICE!$F$2,Nombres!$C$3:$E$853,295)","v":"Turkey"},1,1,1,1,1,1]
[{"$f":"HLOOKUP(INDICE!$F$2,Nombres!$C$3:$F$853,143)","v":"America"},4092,4104,4112,4183,4173,4190]
{"$rows_left_out":46}
{"sheet":"Tipos de cambio","index":23,"n_rows":17,"n_cols":7,"rows_kept":17,"cut":false,"hidden":false,"merged":[[3,1,4,1]]}
[{"$f":"HLOOKUP(INDICE!$F$2,Nombres!$C$3:$F$853,182)","v":"Exchange rates"}]
[{"$f":"HLOOKUP(INDICE!$F$2,Nombres!$C$3:$E$853,167)","v":"(Expressed in currency/euro)"}]
[null,null,{"$f":"HLOOKUP(INDICE!$F$2,Nombres!$C$3:$E$853,175)","v":"Year-end exchange rates (*)"},null,null,{"$f":"HLOOKUP(INDICE!$F$2,Nombres!$C$3:$E$853,176)","v":"Average exchange rates (**)"}]
[null,"2015-06-30",{"$f":"HLOOKUP(INDICE!$F$2,Nombres!$C$3:$E$853,180)","v":"∆ % on"},{"$f":"HLOOKUP(INDICE!$F$2,Nombres!$C$3:$E$853,180)","v":"∆ % on"},null,null,{"$f":"HLOOKUP(INDICE!$F$2,Nombres!$C$3:$E$853,180)","v":"∆ % on"}]
[null,null,"2014-06-30","2015-03-31",null,{"$f":"HLOOKUP(INDICE!$F$2,Nombres!$C$3:$E$853,203)","v":"1H15"},{"$f":"HLOOKUP(INDICE!$F$2,Nombres!$C$3:$E$853,204)","v":"1H14"}]
[{"$f":"HLOOKUP(INDICE!$F$2,Nombres!$C$3:$E$853,168)","v":"Mexican peso"},17.533093714385902,1.0219986538665893,-5.8222288271329745,null,16.884476412386451,6.462224299401413]
{"$rows_left_out":12}
{"sheet":"Rendimientos y costes","index":24,"n_rows":22,"n_cols":13,"rows_kept":22,"cut":false,"hidden":false,"merged":[[2,1,2,3]]}
[{"$f":"HLOOKUP(INDICE!$F$2,Nombres!$C$3:$E$853,199)","v":"Breakdown of yields and costs"}]
[]
[]
[null,{"$f":"HLOOKUP(INDICE!$F$2,Nombres!$C$3:$E$853,231)","v":"1st Quarter"},2014,{"$f":"HLOOKUP(INDICE!$F$2,Nombres!$C$3:$E$853,232)","v":"2nd Quarter"},2014,{"$f":"HLOOKUP(INDICE!$F$2,Nombres!$C$3:$E$853,233)","v":"3rd Quarter"},2014,{"$f":"HLOOKUP(INDICE!$F$2,Nombres!$C$3:$E$853,234)","v":"4th Quarter "},2014,{"$f":"HLOOKUP(INDICE!$F$2,Nombres!$C$3:$E$853,231)","v":"1st Quarter"},2015,{"$f":"HLOOKUP(INDICE!$F$2,Nombres!$C$3:$E$853,236)","v":"2nd Quarter"},2015]
[null,{"$f":"HLOOKUP(INDICE!$F$2,Nombres!$C$3:$E$853,239)","v":"% of ATA"},{"$f":"HLOOKUP(INDICE!$F$2,Nombres!$C$3:$E$853,240)","v":"% yield/Cost"},{"$f":"HLOOKUP(INDICE!$F$2,Nombres!$C$3:$E$853,239)","v":"% of ATA"},{"$f":"HLOOKUP(INDICE!$F$2,Nombres!$C$3:$E$853,240)","v":"% yield/Cost"},{"$f":"HLOOKUP(INDICE!$F$2,Nombres!$C$3:$E$853,239)","v":"% of ATA"},{"$f":"HLOOKUP(INDICE!$F$2,Nombres!$C$3:$E$853,240)","v":"% yield/Cost"},{"$f":"HLOOKUP(INDICE!$F$2,Nombres!$C$3:$E$853,239)","v":"% of ATA"},{"$f":"HLOOKUP(INDICE!$F$2,Nombres!$C$3:$E$853,240)","v":"% yield/Cost"},{"$f":"HLOOKUP(INDICE!$F$2,Nombres!$C$3:$E$853,239)","v":"% of ATA"},{"$f":"HLOOKUP(INDICE!$F$2,Nombres!$C$3:$E$853,240)","v":"% yield/Cost"},{"$f":"HLOOKUP(INDICE!$F$2,Nombres!$C$3:$E$853,239)","v":"% of ATA"},{"$f":"HLOOKUP(INDICE!$F$2,Nombres!$C$3:$E$853,240)","v":"% yield/Cost"}]
[{"$f":"HLOOKUP(INDICE!F2,Nombres!$C$3:$E$853,209)","v":"Cash and balances with central banks"},4.5343310391163927,0.55770989767303714,4.5669106931358252,0.51419250436247799,3.8583779913089664,0.39831876204814265,4.4047163332306596,0.49484349402722472,4.5926783133975411,0.24518267739700411,4.0640516744921635,0.11586531604187429]
{"$rows_left_out":17}
{"sheet":"Nombres","index":25,"n_rows":308,"n_cols":5,"rows_kept":308,"cut":false,"hidden":true,"merged":[]}
[]
[null,"Orden","Inglés","Castellano"]
[null,1,1,2]
[null,2,"Choose your language","Escoja su idioma"]
[null,{"$f":"B4+1","v":3},"Quarterly series (*) - March 2011. Information by geographies","Series trimestrales (*) - Marzo 2011. Información por geografías"]
[null,4,"BBVA Group. Consolidated Income statement","Grupo BBVA. Cuentas de resultados consolidadas"]
{"$rows_left_out":302}