{"text_format":"1","workbook":"xlsx","n_sheets":26,"sheets":["INDICE","Cuenta de resultados","Balances consolidados","Actividad bancaria en España","Actividad inm. en España","Riesgo promoción inmobiliaria","Estados Unidos","Turquía","México","América del sur","Argentina","Chile","Colombia","Perú","Venezuela","AdS_sinVenezuela","Resto de Eurasia","Centro Corporativo","Grupo BBVA sin V ","Corporate & Investment Banking","Eficiencia","Mora,cobertura,prima de riesgo","Empleados,oficinas y cajeros","Tipos de cambio","Rendimientos y costes","Nombres"],"not_rendered":{"charts":0,"images":1,"macros":1,"external_links":10,"defined_names":112,"comments":0,"pivot_tables":0},"unopened":[],"bounds":{"document_bytes":16777216,"sheet_cells":100000,"rows_first":2000,"rows_last":500,"rows_between":2000,"halvings":0,"cell_chars":16384,"cell_head_chars":4096},"cells_cut":0,"cells_raw":0,"read":"whole","date_system":"1900"}

{"sheet":"INDICE","index":0,"n_rows":33,"n_cols":6,"rows_kept":33,"cut":false,"hidden":false,"merged":[]}
[]
[null,null,{"$f":"HLOOKUP($F$2,Nombres!$C$3:$E$853,192)","v":"Quarterly series 2014-2015 "},null,null,1]
[]
[null,null,{"$f":"HLOOKUP($F$2,Nombres!$C$3:$E$853,200)","v":"BBVA Group"},{"$f":"HLOOKUP($F$2,Nombres!$C$3:$E$853,263)","v":"Print"},false]
[null,null,{"$f":"HLOOKUP($F$2,Nombres!$C$3:$E$853,267)","v":"Consolidated income statement"},null,false,{"$f":"OR($E$4,E5)","v":false}]
[null,null,{"$f":"HLOOKUP($F$2,Nombres!$C$3:$E$853,196)","v":"Consolidated balance sheet"},null,false,{"$f":"OR($E$4,E6)","v":false}]
["ESPAÑOL"]
["ENGLISH",null,{"$f":"HLOOKUP($F$2,Nombres!$C$3:$E$853,193)","v":"Business areas"},null,false]
[null,null,{"$f":"HLOOKUP($F$2,Nombres!$C$3:$E$853,7)","v":"Banking activity in Spain"},null,false,{"$f":"OR($E$8,E9)","v":false}]
[null,null,{"$f":"HLOOKUP($F$2,Nombres!$C$3:$E$853,279)","v":"Real-estate business in Spain"},null,false,false]
[null,null,{"$f":"HLOOKUP($F$2,Nombres!$C$3:$E$853,262)","v":"Coverage of real estate exposure in Spain"},null,false,false]
[null,null,{"$f":"HLOOKUP($F$2,Nombres!$C$3:$E$853,20)","v":"The United States"},null,false,false]
[null,null,{"$f":"HLOOKUP($F$2,Nombres!$C$3:$E$853,295)","v":"Turkey"},null,false,false]
[null,null,{"$f":"HLOOKUP($F$2,Nombres!$C$3:$E$853,9)","v":"Mexico"},null,false,false]
[null,null,{"$f":"HLOOKUP($F$2,Nombres!$C$3:$E$853,12)","v":"South America"},null,false,false]
[null,null,{"$f":"HLOOKUP($F$2,Nombres!$C$3:$E$853,15)","v":"Argentina"},null,false,false]
[null,null,{"$f":"HLOOKUP($F$2,Nombres!$C$3:$E$853,16)","v":"Chile"},null,false,false]
[null,null,{"$f":"HLOOKUP($F$2,Nombres!$C$3:$E$853,17)","v":"Colombia"},null,false,false]
[null,null,{"$f":"HLOOKUP($F$2,Nombres!$C$3:$E$853,18)","v":"Peru"},null,false,false]
[null,null,{"$f":"HLOOKUP($F$2,Nombres!$C$3:$E$853,19)","v":"Venezuela"},null,false,false]
[null,null,{"$f":"HLOOKUP($F$2,Nombres!$C$3:$E$853,184)","v":"Rest of Eurasia"},null,false,{"$f":"OR($E$8,E21)","v":false}]
[null,null,{"$f":"HLOOKUP($F$2,Nombres!$C$3:$E$853,25)","v":"Corporate Center "},null,false,false]
[]
[null,null,{"$f":"HLOOKUP($F$2,Nombres!$C$3:$E$853,194)","v":"Additional information:"}]
[null,null,{"$f":"HLOOKUP($F$2,Nombres!$C$3:$E$853,268)","v":"Corporate & Investment Banking"},null,false,{"$f":"OR($E$8,E25)","v":false}]
[null,null,{"$f":"HLOOKUP($F$2,Nombres!$C$3:$E$853,303)","v":"BBVA Group without Venezuela"},null,false,{"$f":"OR($E$8,E26)","v":false}]
[null,null,{"$f":"HLOOKUP($F$2,Nombres!$C$3:$E$853,305)","v":"South America without Venezuela"},null,false,{"$f":"OR($E$8,E27)","v":false}]
[null,null,{"$f":"HLOOKUP($F$2,Nombres!$C$3:$E$853,201)","v":"Annex:"}]
[null,null,{"$f":"HLOOKUP($F$2,Nombres!$C$3:$E$853,26)","v":"Efficiency"},null,false,{"$f":"OR($E$28,E29)","v":false}]
[null,null,{"$f":"HLOOKUP($F$2,Nombres!$C$3:$E$853,27)","v":"NPL, coverage ratios and cost of risk"},null,false,{"$f":"OR($E$28,E30)","v":false}]
[null,null,{"$f":"HLOOKUP($F$2,Nombres!$C$3:$E$853,28)","v":"Branches, employees and atm´s"},null,false,{"$f":"OR($E$28,E31)","v":false}]
[null,null,{"$f":"HLOOKUP($F$2,Nombres!$C$3:$E$853,182)","v":"Exchange rates"},null,false,{"$f":"OR($E$28,E32)","v":false}]
[null,null,{"$f":"HLOOKUP($F$2,Nombres!$C$3:$E$853,199)","v":"Breakdown of yields and costs"},null,false,{"$f":"OR($E$28,E33)","v":false}]

{"sheet":"Cuenta de resultados","index":1,"n_rows":61,"n_cols":7,"rows_kept":61,"cut":false,"hidden":false,"merged":[[60,0,60,6],[28,0,28,6],[29,0,29,6],[2,1,2,4],[2,5,2,6],[32,1,32,4],[32,5,32,6],[59,0,59,6]]}
[{"$f":"HLOOKUP(INDICE!$F$2,Nombres!$C$3:$E$853,290)","v":"Consolidated income statement (*)"}]
[{"$f":"HLOOKUP(INDICE!$F$2,Nombres!$C$3:$E$853,30)","v":"(Million euros)"}]
[null,2014,null,null,null,2015]
[null,{"$f":"HLOOKUP(INDICE!$F$2,Nombres!$C$3:$E$857,34)","v":"1st Quarter"},{"$f":"HLOOKUP(INDICE!$F$2,Nombres!$C$3:$E$857,35)","v":"2nd Quarter"},{"$f":"HLOOKUP(INDICE!$F$2,Nombres!$C$3:$E$857,36)","v":"3rd Quarter"},{"$f":"HLOOKUP(INDICE!$F$2,Nombres!$C$3:$E$857,37)","v":"4th Quarter"},{"$f":"HLOOKUP(INDICE!$F$2,Nombres!$C$3:$E$857,34)","v":"1st Quarter"},{"$f":"HLOOKUP(INDICE!$F$2,Nombres!$C$3:$E$857,35)","v":"2nd Quarter"}]
[{"$f":"HLOOKUP(INDICE!$F$2,Nombres!$C$3:$E$853,38)","v":"Net interest income"},3390.5869999999995,3647.451,3829.9220000000005,4248.2979999999998,3662.9660000000003,3857.7450000099998]
[{"$f":"HLOOKUP(INDICE!$F$2,Nombres!$C$3:$E$853,39)","v":"Net fees and commissions"},985.17599999999993,1101.174,1111.2639999999999,1167.566,1076.7649999999999,1139.6320000000001]
[{"$f":"HLOOKUP(INDICE!$F$2,Nombres!$C$3:$E$853,40)","v":"Net trading income"},750.65899999999999,425.81500000000005,444.11200000000002,514.39100000000008,775.27100000000007,649.78300000000002]
[{"$f":"HLOOKUP(INDICE!$F$2,Nombres!$C$3:$E$853,41)","v":"Dividends"},28.536999999999999,342.07100000000003,41.59,118.78,41.867000000000004,194.232]
[{"$f":"HLOOKUP(INDICE!$F$2,Nombres!$C$3:$E$853,42)","v":"Income by the equity method"},-14.395,15.876999999999999,30.523,2.8410000000000011,2.79,17.981000000000002]
[{"$f":"HLOOKUP(INDICE!$F$2,Nombres!$C$3:$E$853,43)","v":"Other operating income and expenses"},-89.657000000000011,-215.06800000000001,-234.096,-286.76099999999997,72.520999999999958,62.38]
[{"$f":"HLOOKUP(INDICE!$F$2,Nombres!$C$3:$E$853,44)","v":"Gross income"},5050.9069999999992,5317.32,5223.3150000000005,5765.1149999999998,5632.18,5921.7530000099996]
[{"$f":"HLOOKUP(INDICE!$F$2,Nombres!$C$3:$E$853,45)","v":"Operating expenses"},-2612.9459999999999,-2662.2150000000001,-2770.3760000000002,-2905.3959999999997,-2775.518,-2942.0259999999998]
[{"$f":"HLOOKUP(INDICE!$F$2,Nombres!$C$3:$E$853,46)","v":"  Administration expenses"},-2334.0650002100001,-2376.3830008300001,-2474.8439990299998,-2585.2950008899998,-2484.1629986500002,-2643.3100002800002]
[{"$f":"HLOOKUP(INDICE!$F$2,Nombres!$C$3:$E$853,47)","v":"  Personnel expenses"},-1374.9050011700001,-1359.04499889,-1437.54400014,-1437.9170019799999,-1459.9489994600001,-1537.6440055399999]
[{"$f":"HLOOKUP(INDICE!$F$2,Nombres!$C$3:$E$853,48)","v":"  General and administrative expenses"},-959.15999904,-1017.33800194,-1037.2999988900001,-1147.3779989100001,-1024.2139991899999,-1105.6659947399999]
[{"$f":"HLOOKUP(INDICE!$F$2,Nombres!$C$3:$E$853,49)","v":"  Depreciation and amortization"},-278.88099979000003,-285.83199917000002,-295.53200097000001,-320.10099910999998,-291.35500135000001,-298.71599972000001]
[{"$f":"HLOOKUP(INDICE!$F$2,Nombres!$C$3:$E$853,50)","v":"Operating income"},2437.9610000000002,2655.105,2452.9390000000003,2859.7190000000001,2856.6619999999998,2979.7270000099998]
[{"$f":"HLOOKUP(INDICE!$F$2,Nombres!$C$3:$E$853,51)","v":"Impairment on financial assets (net)"},-1103.3720000000001,-1073.1480000000001,-1141.693,-1167.9880000000001,-1119.431,-1088.875]
[{"$f":"HLOOKUP(INDICE!$F$2,Nombres!$C$3:$E$853,52)","v":"Provisions"},-144.441,-298.20799999999997,-199.27199999999999,-513.33899999999994,-229.57,-164.02]
[{"$f":"HLOOKUP(INDICE!$F$2,Nombres!$C$3:$E$853,53)","v":"Other gains (losses)"},-173.28100000000001,-191.44399999999999,-136.00799999999998,-200.58600000000001,-65.801999999999992,-122.63499999999999]
[{"$f":"HLOOKUP(INDICE!$F$2,Nombres!$C$3:$E$853,54)","v":"Income before tax"},1016.867,1092.3050000000001,975.96600000000012,977.80600000000004,1441.8589999999999,1604.19700001]
[{"$f":"HLOOKUP(INDICE!$F$2,Nombres!$C$3:$E$853,55)","v":"Income tax"},-273.24099999999999,-292.33499999999998,-242.66199999999998,-172.93899999999999,-386.13,-429.00199999999995]
[{"$f":"HLOOKUP(INDICE!$F$2,Nombres!$C$3:$E$853,269)","v":"Net income from ongoing operations"},743.62599999999998,799.97,733.30399999999997,804.86700000000008,1055.729,1175.1950000100001]
[{"$f":"HLOOKUP(INDICE!$F$2,Nombres!$C$3:$E$853,270)","v":"Result from corporate operations"},0,0,0,0,582.94200000000001,144.274]
[{"$f":"HLOOKUP(INDICE!$F$2,Nombres!$C$3:$E$853,56)","v":"Net income"},743.62599999999998,799.97,733.30399999999997,804.86700000000008,1638.6710000000003,1319.4690000099999]
[{"$f":"HLOOKUP(INDICE!$F$2,Nombres!$C$3:$E$853,57)","v":"Non-controlling interests"},-119.714,-95.489000000000004,-132.31200000000001,-116.233,-102.67699999999999,-96.896999999999991]
[{"$f":"HLOOKUP(INDICE!$F$2,Nombres!$C$3:$E$853,58)","v":"Net attributable profit"},623.91200000000003,704.48099999999999,600.99199999999996,688.63400000000001,1535.9940000000001,1222.57200001]
[{"$f":"HLOOKUP(INDICE!$F$2,Nombres!$C$3:$E$853,242)","v":"Net attributable profit (excluding results from corporate operations) (**)"},623.91200000000003,704.48099999999999,600.99199999999996,688.63400000000001,953.05200000000013,1078.2980000100001]
[{"$f":"HLOOKUP(INDICE!$F$2,Nombres!$C$3:$E$853,289)","v":"(*) Financial statements with the revenues and expenses of the Garanti Group consolidated in proportion to the percentage of the Group's stake."}]
[{"$f":"HLOOKUP(INDICE!$F$2,Nombres!$C$3:$E$853,29)","v":"(**) 2015 includes the capitral gains from the various sale operations equivalent to 6.34 of BBVA Group's stake in CNCB and the badwill from Catalunya Banc operation. "}]
[{"$f":"HLOOKUP(INDICE!$F$2,Nombres!$C$3:$E$853,290)","v":"Consolidated income statement (*)"}]
[{"$f":"HLOOKUP(INDICE!$F$2,Nombres!$C$3:$E$853,31)","v":"(Constant million euros)    "}]
[null,2014,null,null,null,2015]
[null,{"$f":"HLOOKUP(INDICE!$F$2,Nombres!$C$3:$E$857,34)","v":"1st Quarter"},{"$f":"HLOOKUP(INDICE!$F$2,Nombres!$C$3:$E$857,35)","v":"2nd Quarter"},{"$f":"HLOOKUP(INDICE!$F$2,Nombres!$C$3:$E$857,36)","v":"3rd Quarter"},{"$f":"HLOOKUP(INDICE!$F$2,Nombres!$C$3:$E$857,37)","v":"4th Quarter"},{"$f":"HLOOKUP(INDICE!$F$2,Nombres!$C$3:$E$857,34)","v":"1st Quarter"},{"$f":"HLOOKUP(INDICE!$F$2,Nombres!$C$3:$E$857,35)","v":"2nd Quarter"}]
[{"$f":"HLOOKUP(INDICE!$F$2,Nombres!$C$3:$E$853,38)","v":"Net interest income"},3331.2902881128002,3418.5754013753003,3490.7233942088997,3736.9064910789002,3652.8061010720999,3867.9048989378998]
[{"$f":"HLOOKUP(INDICE!$F$2,Nombres!$C$3:$E$853,39)","v":"Net fees and commissions"},1014.4497557242,1101.7174459562,1079.6900092696001,1096.6469815549001,1074.8311583577999,1141.5658416422002]
[{"$f":"HLOOKUP(INDICE!$F$2,Nombres!$C$3:$E$853,40)","v":"Net trading income"},703.7566652388,434.62218945550001,440.40751073069998,512.4297348473001,771.77052748760002,653.28347251240007]
[{"$f":"HLOOKUP(INDICE!$F$2,Nombres!$C$3:$E$853,41)","v":"Dividends"},29.671204128300005,343.90102980540001,42.857286451900002,119.4813220554,41.929934135099998,194.16906586490001]
[{"$f":"HLOOKUP(INDICE!$F$2,Nombres!$C$3:$E$853,42)","v":"Income by the equity method"},-13.048528983799999,16.854502623399998,31.595908302200002,3.6258379840000003,2.7402518893000005,18.030748110699999]
[{"$f":"HLOOKUP(INDICE!$F$2,Nombres!$C$3:$E$853,43)","v":"Other operating income and expenses"},25.630862301500002,33.193399189600001,-4.3829885146999983,46.201441158900003,73.445402130700003,61.455597869300007]
[{"$f":"HLOOKUP(INDICE!$F$2,Nombres!$C$3:$E$853,44)","v":"Gross income"},5091.7502465218004,5348.8639684054006,5080.8911204487003,5515.2918086792997,5617.5233750726002,5936.4096249374998]
[{"$f":"HLOOKUP(INDICE!$F$2,Nombres!$C$3:$E$853,45)","v":"Operating expenses"},-2681.9332686764001,-2681.2618328680001,-2735.6689379689001,-2769.6848470215,-2771.8272985956,-2945.7167014042998]
[{"$f":"HLOOKUP(INDICE!$F$2,Nombres!$C$3:$E$853,46)","v":"  Administration expenses"},-2398.1466560345998,-2397.5015873006996,-2447.4489596664002,-2482.7117938937999,-2480.6955456971,-2646.7774532328003]
[{"$f":"HLOOKUP(INDICE!$F$2,Nombres!$C$3:$E$853,47)","v":"  Personnel expenses"},-1423.7619746436999,-1387.9223165961998,-1444.2969219615002,-1407.7437982239001,-1458.5021636788999,-1539.0908413212001]
[{"$f":"HLOOKUP(INDICE!$F$2,Nombres!$C$3:$E$853,48)","v":"  General and administrative expenses"},-974.38468139090014,-1009.5792707044001,-1003.1520377050999,-1074.9679956698999,-1022.1933820182999,-1107.6866119116999]
[{"$f":"HLOOKUP(INDICE!$F$2,Nombres!$C$3:$E$853,49)","v":"  Depreciation and amortization"},-283.7866126417,-283.76024556739998,-288.21997830240002,-286.97305312790002,-291.1317528985,-298.93924817160001]
[{"$f":"HLOOKUP(INDICE!$F$2,Nombres!$C$3:$E$853,50)","v":"Operating income"},2409.8169778452998,2667.6021355373,2345.2221824797998,2745.6069616576997,2845.6960764770001,2990.6929235330999]
[{"$f":"HLOOKUP(INDICE!$F$2,Nombres!$C$3:$E$853,51)","v":"Impairment on financial assets (net)"},-1123.0292130898001,-1060.1536070278999,-1094.0203245577,-1102.2758514541001,-1117.1235684963999,-1091.1824315034999]
[{"$f":"HLOOKUP(INDICE!$F$2,Nombres!$C$3:$E$853,52)","v":"Provisions"},-131.2477556666,-286.61810624809999,-180.2954641986,-474.40545796000004,-227.70830816149999,-165.88169183849999]
[{"$f":"HLOOKUP(INDICE!$F$2,Nombres!$C$3:$E$853,53)","v":"Other gains (losses)"},-173.97656399459999,-190.71999794480001,-135.1565961206,-203.09430097480001,-65.927783645400012,-122.5092163545]
[{"$f":"HLOOKUP(INDICE!$F$2,Nombres!$C$3:$E$853,54)","v":"Income before tax"},981.56344509430005,1130.1104243165,935.74979760290012,965.83135126899992,1434.9364161736,1611.1195838364999]
[{"$f":"HLOOKUP(INDICE!$F$2,Nombres!$C$3:$E$853,55)","v":"Income tax"},-253.96860879880001,-291.90470060780001,-233.82805654949999,-183.00025965290001,-383.91951734880001,-431.21248265109995]
[{"$f":"HLOOKUP(INDICE!$F$2,Nombres!$C$3:$E$853,269)","v":"Net income from ongoing operations"},727.59483629550004,838.20572370850005,701.92174105329991,782.83109161600009,1051.0168988246999,1179.9071011854001]
[{"$f":"HLOOKUP(INDICE!$F$2,Nombres!$C$3:$E$853,270)","v":"Result from corporate operations"},0,0,0,0,582.94200000000001,144.274]
[{"$f":"HLOOKUP(INDICE!$F$2,Nombres!$C$3:$E$853,56)","v":"Net income"},727.59483629550004,838.20572370850005,701.92174105329991,782.83109161600009,1633.9588988247001,1324.1811011853999]
[{"$f":"HLOOKUP(INDICE!$F$2,Nombres!$C$3:$E$853,57)","v":"Non-controlling interests"},-83.8177372472,-90.8349085702,-103.6499048874,-91.378551611700004,-101.85582065,-97.71817935]
[{"$f":"HLOOKUP(INDICE!$F$2,Nombres!$C$3:$E$853,58)","v":"Net attributable profit"},643.7770990483001,747.37081513830003,598.27183616599996,691.45254000440002,1532.1030781746999,1226.4629218354]
[{"$f":"HLOOKUP(INDICE!$F$2,Nombres!$C$3:$E$853,242)","v":"Net attributable profit (excluding results from corporate operations) (**)"},643.77709904829999,747.37081513830003,598.27183616599996,691.45254000440002,949.16107817469992,1082.1889218353999]
[]
[{"$f":"HLOOKUP(INDICE!$F$2,Nombres!$C$3:$E$853,289)","v":"(*) Financial statements with the revenues and expenses of the Garanti Group consolidated in proportion to the percentage of the Group's stake."}]
[{"$f":"HLOOKUP(INDICE!$F$2,Nombres!$C$3:$E$853,29)","v":"(**) 2015 includes the capitral gains from the various sale operations equivalent to 6.34 of BBVA Group's stake in CNCB and the badwill from Catalunya Banc operation. "}]

{"sheet":"Balances consolidados","index":2,"n_rows":78,"n_cols":7,"rows_kept":78,"cut":false,"hidden":false,"merged":[]}
[{"$f":"HLOOKUP(INDICE!$F$2,Nombres!$C$3:$E$853,291)","v":"BBVA Group. Consolidated balance sheet (*)"}]
[{"$f":"HLOOKUP(INDICE!F2,Nombres!$C$3:$E$853,30)","v":"(Million euros)"}]
[]
[null,"2014-03-31","2014-06-30","2014-09-30","2014-12-31","2015-03-31","2015-06-30"]
[]
[{"$f":"HLOOKUP(INDICE!F2,Nombres!$C$3:$E$853,63)","v":"Cash and balances with central banks"},27546.094000000001,27210.223000000002,23120.532999999999,33908.392999999996,27553.317999999999,30192.351999999999]
[{"$f":"HLOOKUP(INDICE!F2,Nombres!$C$3:$E$853,64)","v":"Financial assets held for trading"},76433.225999999995,79589.286999999997,88023.118000000002,83426.686000000002,94882.676000000007,82693.035999999993]
[{"$f":"HLOOKUP(INDICE!F2,Nombres!$C$3:$E$853,65)","v":"Other financial assets designated at fair value"},3384.569,2989.5450000000001,3227.0830000000001,3235.5439999999999,3602.8440000000001,3498.5920000000001]
[{"$f":"HLOOKUP(INDICE!F2,Nombres!$C$3:$E$853,66)","v":"Financial assets available for sale"},88236.263999999996,92316.255000000005,98322.123999999996,98733.926999999996,101182.75900000001,107135.899]
[{"$f":"HLOOKUP(INDICE!F2,Nombres!$C$3:$E$853,67)","v":"Loans and receivables"},360937.63699999999,372180.09600000002,379715.10800000001,386839.223,398558.473,415020.402]
[{"$f":"HLOOKUP(INDICE!F2,Nombres!$C$3:$E$853,68)","v":". Due from banks"},21441.327000000001,27874.334999999999,27560.835999999999,28253.82,33671.557000000001,29074.346000000001]
[{"$f":"HLOOKUP(INDICE!F2,Nombres!$C$3:$E$853,69)","v":". Loans and advances to customers"},334697.79499999998,339062.61599999998,346103.35200000001,351754.58799999999,360265.26,374887.67800000001]
[{"$f":"HLOOKUP(INDICE!F2,Nombres!$C$3:$E$853,300)","v":". Debt securities"},4798.5150000000003,5243.1450000000004,6050.92,6830.8149999999996,4621.6559999999999,11058.378000000001]
[{"$f":"HLOOKUP(INDICE!F2,Nombres!$C$3:$E$853,71)","v":"Held to maturity investments"},"-","-","-","-","-","-"]
[{"$f":"HLOOKUP(INDICE!F2,Nombres!$C$3:$E$853,72)","v":"Investments in associates"},1318.8389999999999,1338.81,1443.184,661.42499999999995,673.96900000000005,1012.598]
[{"$f":"HLOOKUP(INDICE!F2,Nombres!$C$3:$E$853,73)","v":"Tangible assets"},7473.518,7466.19,7762.0730000000003,8014.1850000000004,8056.8370000000004,8752.9439999999995]
[{"$f":"HLOOKUP(INDICE!F2,Nombres!$C$3:$E$853,74)","v":"Intangible assets"},8138.8220000000001,8218.9889999999996,8621.0959999999995,8839.9390000000003,9493.4050000000007,9212.0339999999997]
[{"$f":"HLOOKUP(INDICE!F2,Nombres!$C$3:$E$853,75)","v":"Other assets"},25666.232999999949,25822.005000000063,27464.840000000084,27851.240999999864,28593.281999999832,31553.232999999949]
[{"$f":"HLOOKUP(INDICE!F2,Nombres!$C$3:$E$853,76)","v":"Total assets"},599135.20200000005,617131.4,637699.15800000005,651510.56299999997,672597.56400000001,689071.09]
[]
[{"$f":"HLOOKUP(INDICE!F2,Nombres!$C$3:$E$853,77)","v":"Financial liabilities held for trading"},48975.635999999999,51868.74,59083.521000000001,56990.141000000003,67437.782000000007,56977.112999999998]
[{"$f":"HLOOKUP(INDICE!F2,Nombres!$C$3:$E$853,78)","v":"Other financial liabilities at fair value"},3039.65,3394.7739999999999,3614.7080000000001,3590.1990000000001,3903.2350000000001,3746.4180000000001]
[{"$f":"HLOOKUP(INDICE!F2,Nombres!$C$3:$E$853,79)","v":"Financial liabilities at amortised cost"},476656.00599999999,486888.53600000002,497179.103,509973.92999999993,518819.42499999999,546479.76100000006]
[{"$f":"HLOOKUP(INDICE!F2,Nombres!$C$3:$E$853,80)","v":". Deposits from central banks and credit institutions"},84461.046999999991,81772.369000000006,84199.317999999999,97734.702999999994,92546.854999999996,94763.18299999999]
[{"$f":"HLOOKUP(INDICE!F2,Nombres!$C$3:$E$853,81)","v":". Deposits from customers"},309817.34000000003,320796.46399999998,329609.864,330685.92599999998,339674.51199999999,363372.821]
[{"$f":"HLOOKUP(INDICE!F2,Nombres!$C$3:$E$853,208)","v":" .Other debt certificates"},62891.544999999998,62644.603999999999,61181.237999999998,59393.042000000001,58258.856,62298.588000000003]
[{"$f":"HLOOKUP(INDICE!F2,Nombres!$C$3:$E$853,83)","v":". Subordinated liabilities"},12122.837,13820.9,14265.227000000001,14118.192999999999,15723.075999999999,16126.071]
[{"$f":"HLOOKUP(INDICE!F2,Nombres!$C$3:$E$853,84)","v":". Other financial liabilities"},7363.2370000000001,7854.1989999999996,7923.4560000000001,8042.0659999999998,12616.126,9919.098]
[{"$f":"HLOOKUP(INDICE!F2,Nombres!$C$3:$E$853,85)","v":"Liabilities under insurance contracts"},10102.003000000001,10265.858,10624.05,10470.828,11192.771000000001,10333.217000000001]
[{"$f":"HLOOKUP(INDICE!F2,Nombres!$C$3:$E$853,86)","v":"Other liabilities"},16306.017999999945,17846.333000000006,18808.366999999904,18876.653999999999,18878.709000000075,20537.678000000029]
[{"$f":"HLOOKUP(INDICE!F2,Nombres!$C$3:$E$853,87)","v":"Total liabilities"},555079.31299999997,570264.24100000004,589309.74899999995,599901.75199999998,620231.92200000002,638074.18700000003]
[]
[{"$f":"HLOOKUP(INDICE!F2,Nombres!$C$3:$E$853,88)","v":"Minority interests"},1862.829,2047.84,2252.88,2510.84,1691.644,1727.9739999999999]
[{"$f":"HLOOKUP(INDICE!F2,Nombres!$C$3:$E$853,89)","v":"Valuation adjustments"},-3636.491,-2145.585,-878.79399999999998,-348.40699999999998,327.322,-2908.5360000000001]
[{"$f":"HLOOKUP(INDICE!F2,Nombres!$C$3:$E$853,90)","v":"Shareholders' funds"},45829.550999999999,46964.904000000002,47015.322999999997,49446.377999999997,50346.675999999999,52177.464999999997]
[{"$f":"HLOOKUP(INDICE!F2,Nombres!$C$3:$E$853,91)","v":"Equity"},44055.889000000003,46867.159,48389.409,51608.811000000002,52365.642,50996.902999999998]
[]
[{"$f":"HLOOKUP(INDICE!F2,Nombres!$C$3:$E$853,92)","v":"Total liabilities and equity"},599135.20200000005,617131.4,637699.15800000005,651510.56299999997,672597.56400000001,689071.09]
[{"$f":"HLOOKUP(INDICE!F2,Nombres!$C$3:$E$853,276)","v":"(*) Financial statements with the assets and liabilities of the Garanti Group consolidated in proportion to the percentage of the Group's stake. "}]
[{"$f":"HLOOKUP(INDICE!F2,Nombres!$C$3:$E$853,291)","v":"BBVA Group. Consolidated balance sheet (*)"}]
[{"$f":"HLOOKUP(INDICE!F2,Nombres!$C$3:$E$853,31)","v":"(Constant million euros)    "}]
[]
[null,"2014-03-31","2014-06-30","2014-09-30","2014-12-31","2015-03-31","2015-06-30"]
[]
[{"$f":"HLOOKUP(INDICE!F2,Nombres!$C$3:$E$853,63)","v":"Cash and balances with central banks"},24787.464367636199,24077.047835136902,20004.788208349899,28927.945965937797,26246.769708293199,30192.353999999999]
[{"$f":"HLOOKUP(INDICE!F2,Nombres!$C$3:$E$853,64)","v":"Financial assets held for trading"},76919.9441110607,79727.428094156203,87320.768244799401,83976.405239135405,93279.182028578201,82693.035000000003]
[{"$f":"HLOOKUP(INDICE!F2,Nombres!$C$3:$E$853,65)","v":"Other financial assets designated at fair value"},3542.5021817687002,3105.1329145500999,3220.5242145999,3293.5603815651998,3425.5419319850998,3498.5920000000001]
[{"$f":"HLOOKUP(INDICE!F2,Nombres!$C$3:$E$853,66)","v":"Financial assets available for sale"},88719.609654987813,92456.024322422702,97315.174193576488,98163.865021547696,99430.742430623301,107135.898]
[{"$f":"HLOOKUP(INDICE!F2,Nombres!$C$3:$E$853,67)","v":"Loans and receivables"},365455.73932422412,373417.20799222041,372943.88120551582,379374.2054340085,389467.45103197393,415020.39299999998]
[{"$f":"HLOOKUP(INDICE!F2,Nombres!$C$3:$E$853,68)","v":". Due from banks"},21270.980989996202,27624.7214968074,27071.501412067391,27854.688976371694,33205.522634077402,29074.343000000001]
[{"$f":"HLOOKUP(INDICE!F2,Nombres!$C$3:$E$853,69)","v":". Loans and advances to customers"},340220.25499253866,341586.11819187901,341508.09588344832,346975.63237781409,351720.47131358314,374887.67300000001]
[{"$f":"HLOOKUP(INDICE!F2,Nombres!$C$3:$E$853,300)","v":". Debt securities"},3964.5033416892998,4206.368303534,4364.2839100001001,4543.8840798228002,4541.4570843133997,11058.377]
[{"$f":"HLOOKUP(INDICE!F2,Nombres!$C$3:$E$853,71)","v":"Held to maturity investments"},4.495461324699999,4.1610711880000011,4.0731110664999974,1.6108619239000017,5.6600307500000002E-2,-2E-3]
[{"$f":"HLOOKUP(INDICE!F2,Nombres!$C$3:$E$853,72)","v":"Investments in associates"},1288.9224487864999,1310.7990343502001,1401.4333210174,637.48878195709995,694.06856019750012,1012.598]
[{"$f":"HLOOKUP(INDICE!F2,Nombres!$C$3:$E$853,73)","v":"Tangible assets"},7500.0487096106999,7407.6503257098002,7540.4071417252999,7764.1304561688003,7839.7620497960997,8752.9439999999995]
[{"$f":"HLOOKUP(INDICE!F2,Nombres!$C$3:$E$853,74)","v":"Intangible assets"},8255.9268204596992,8308.7268155290003,8645.0466920383005,8861.3138414802997,9415.9266263244008,9212.0329999999994]
[{"$f":"HLOOKUP(INDICE!F2,Nombres!$C$3:$E$853,75)","v":"Other assets"},26015.889119654901,26030.190535640802,27449.621536661474,27665.962123539699,28219.836095078801,31553.226999999803]
[{"$f":"HLOOKUP(INDICE!F2,Nombres!$C$3:$E$853,76)","v":"Total assets"},602490.54219951411,615844.36894090427,625845.71786935045,638666.48810726427,658019.33706315805,689071.07199999993]
[]
[{"$f":"HLOOKUP(INDICE!F2,Nombres!$C$3:$E$853,77)","v":"Financial liabilities held for trading"},49286.177022384807,52040.544742954095,58968.359492279698,57398.203965608904,66645.449085546803,56977.110999999997]
[{"$f":"HLOOKUP(INDICE!F2,Nombres!$C$3:$E$853,78)","v":"Other financial liabilities at fair value"},3080.4732267823001,3387.2757190414,3524.3263476928,3578.0950700013,3724.6570617605998,3746.4180000000001]
[{"$f":"HLOOKUP(INDICE!F2,Nombres!$C$3:$E$853,79)","v":"Financial liabilities at amortised cost"},478593.88387295225,485493.07287623466,487191.7476960115,498324.36843017157,507179.36885676679,546479.74800000002]
[{"$f":"HLOOKUP(INDICE!F2,Nombres!$C$3:$E$853,80)","v":". Deposits from central banks and credit institutions"},85698.1188884289,82882.591223948111,84273.610250461585,97976.447416326511,91051.126040033705,94763.178]
[{"$f":"HLOOKUP(INDICE!F2,Nombres!$C$3:$E$853,81)","v":". Deposits from customers"},310259.50198250258,318203.22859394626,319881.74895919801,318857.24017971411,331130.7468488689,363372.81599999999]
[{"$f":"HLOOKUP(INDICE!F2,Nombres!$C$3:$E$853,208)","v":" .Other debt certificates"},63249.479800861693,62882.994770249788,61273.6501449852,59616.146276326297,57487.3106765294,62298.586000000003]
[{"$f":"HLOOKUP(INDICE!F2,Nombres!$C$3:$E$853,83)","v":". Subordinated liabilities"},12423.3899063147,14025.57232431,14252.5308294563,14285.1013662972,15316.875586595201,16126.071]
[{"$f":"HLOOKUP(INDICE!F2,Nombres!$C$3:$E$853,84)","v":". Other financial liabilities"},6963.3932948442998,7498.6859637803991,7510.2075119104002,7589.4331915074999,12193.3097047397,9919.0969999999998]
[{"$f":"HLOOKUP(INDICE!F2,Nombres!$C$3:$E$853,85)","v":"Liabilities under insurance contracts"},10201.225392500701,10275.9714093004,10448.7985803466,10558.0186350034,10873.5585017086,10333.217000000001]
[{"$f":"HLOOKUP(INDICE!F2,Nombres!$C$3:$E$853,86)","v":"Other liabilities"},18071.11677498377,18482.328720168185,18718.194697121999,18639.467617598697,17945.113133007577,20537.679001010012]
[{"$f":"HLOOKUP(INDICE!F2,Nombres!$C$3:$E$853,87)","v":"Total liabilities"},558846.93326826615,569672.02671021782,578851.42681345262,588498.15371838387,606368.14663879026,638074.17300100997]
[]
[{"$f":"HLOOKUP(INDICE!F2,Nombres!$C$3:$E$853,88)","v":"Minority interests"},1360.5006308439999,1449.0477949682997,1556.2516902354,1653.6549310917001,1602.0679289477,1727.9739999999999]
[{"$f":"HLOOKUP(INDICE!F2,Nombres!$C$3:$E$853,89)","v":"Valuation adjustments"},-3614.5282992307998,-2089.7305180111998,-803.52603127899977,-287.02162705030014,373.77335193739998,-2908.5360000000001]
[{"$f":"HLOOKUP(INDICE!F2,Nombres!$C$3:$E$853,90)","v":"Shareholders' funds"},45897.636599634701,46813.024953729298,46241.565396941398,48801.701084839005,49675.349143482796,52177.460998989998]
[{"$f":"HLOOKUP(INDICE!F2,Nombres!$C$3:$E$853,91)","v":"Equity"},43643.608931247902,46172.342230686496,46994.291055897796,50168.334388880394,51651.1904243678,50996.89899899]
[]
[{"$f":"HLOOKUP(INDICE!F2,Nombres!$C$3:$E$853,92)","v":"Total liabilities and equity"},602490.54219951411,615844.36894090427,625845.71786935045,638666.48810726427,658019.33706315805,689071.07199999993]
[{"$f":"HLOOKUP(INDICE!F2,Nombres!$C$3:$E$853,276)","v":"(*) Financial statements with the assets and liabilities of the Garanti Group consolidated in proportion to the percentage of the Group's stake. "}]

{"sheet":"Actividad bancaria en España","index":3,"n_rows":51,"n_cols":7,"rows_kept":51,"cut":false,"hidden":false,"merged":[[3,1,3,4],[3,5,3,6]]}
[{"$f":"HLOOKUP(INDICE!$F$2,Nombres!$C$3:$E$853,301)","v":"Banking activity in Spain"}]
[{"$f":"HLOOKUP(INDICE!$F$2,Nombres!$C$3:$E$853,93)","v":"Income statement  "}]
[{"$f":"HLOOKUP(INDICE!$F$2,Nombres!$C$3:$E$853,30)","v":"(Million euros)"}]
[null,2014,null,null,null,2015]
[null,{"$f":"HLOOKUP(INDICE!$F$2,Nombres!$C$3:$E$857,34)","v":"1st Quarter"},{"$f":"HLOOKUP(INDICE!$F$2,Nombres!$C$3:$E$857,35)","v":"2nd Quarter"},{"$f":"HLOOKUP(INDICE!$F$2,Nombres!$C$3:$E$857,36)","v":"3rd Quarter"},{"$f":"HLOOKUP(INDICE!$F$2,Nombres!$C$3:$E$857,37)","v":"4th Quarter"},{"$f":"HLOOKUP(INDICE!$F$2,Nombres!$C$3:$E$857,34)","v":"1st Quarter"},{"$f":"HLOOKUP(INDICE!$F$2,Nombres!$C$3:$E$857,35)","v":"2nd Quarter"}]
[{"$f":"HLOOKUP(INDICE!$F$2,Nombres!$C$3:$E$853,38)","v":"Net interest income"},930.96706586999994,937.72312753000006,965.53561285000001,995.90663482000014,967.68306816999996,1014.4287571300001]
[{"$f":"HLOOKUP(INDICE!$F$2,Nombres!$C$3:$E$853,39)","v":"Net fees and commissions"},346.78753734999998,386.16494346000002,352.89010238999998,366.90888502000001,377.61749039,432.18116391000001]
[{"$f":"HLOOKUP(INDICE!$F$2,Nombres!$C$3:$E$853,40)","v":"Net trading income"},436.62793154000002,205.80925380000002,151.02561763,355.59571202000001,336.71862877000001,338.05108863999999]
[{"$f":"HLOOKUP(INDICE!$F$2,Nombres!$C$3:$E$853,95)","v":"Other income/expenses"},39.040752609999998,101.18833848,24.842185870000002,23.707379500000002,103.95034973,140.31485931]
[{"$f":"HLOOKUP(INDICE!$F$2,Nombres!$C$3:$E$853,44)","v":"Gross income"},1753.4232873700003,1630.8856632699999,1494.2935187399999,1742.1186113600002,1785.9695370600002,1924.97586899]
[{"$f":"HLOOKUP(INDICE!$F$2,Nombres!$C$3:$E$853,45)","v":"Operating expenses"},-705.83880510000006,-713.59036386000002,-718.26929180000002,-708.35720705999995,-704.85753147999992,-798.42592227]
[{"$f":"HLOOKUP(INDICE!$F$2,Nombres!$C$3:$E$853,46)","v":"  Administration expenses"},-679.54151790000003,-687.48215316999995,-691.76784381999994,-681.91633009999998,-679.44226925999999,-767.83183416999998]
[{"$f":"HLOOKUP(INDICE!$F$2,Nombres!$C$3:$E$853,47)","v":"  Personnel expenses"},-437.72404273000001,-419.37679239000005,-436.23613212999999,-413.83921851999997,-410.66000136000002,-458.24162359000002]
[{"$f":"HLOOKUP(INDICE!$F$2,Nombres!$C$3:$E$853,48)","v":"  General and administrative expenses"},-241.81747517000002,-268.10536078000001,-255.53171169000001,-268.07711158000001,-268.78226789999997,-309.59021058000002]
[{"$f":"HLOOKUP(INDICE!$F$2,Nombres!$C$3:$E$853,49)","v":"  Depreciation and amortization"},-26.2972872,-26.10821069,-26.501447979999998,-26.440876960000004,-25.415262219999999,-30.5940881]
[{"$f":"HLOOKUP(INDICE!$F$2,Nombres!$C$3:$E$853,50)","v":"Operating income"},1047.5844822700001,917.29529940999998,776.02422693999995,1033.7614043000001,1081.11200558,1126.54994672]
[{"$f":"HLOOKUP(INDICE!$F$2,Nombres!$C$3:$E$853,51)","v":"Impairment on financial assets (net)"},-462.86292189,-396.05198036000002,-385.82296559999997,-445.36181323,-420.75555208000003,-354.44911894000001]
[{"$f":"HLOOKUP(INDICE!$F$2,Nombres!$C$3:$E$853,160)","v":"Provisions (net) and other gains/losses"},-34.866818770000002,-203.32414678000001,-75.989574609999991,-308.97495177999997,-164.19889054000001,-115.88539314000001]
[{"$f":"HLOOKUP(INDICE!$F$2,Nombres!$C$3:$E$853,54)","v":"Income before tax"},549.85474161000002,317.91917226999999,314.21168673,279.42463928999996,496.15756296000001,656.21543464000001]
[{"$f":"HLOOKUP(INDICE!$F$2,Nombres!$C$3:$E$853,55)","v":"Income tax"},-164.61867627999999,-93.405189960000001,-87.099492479999995,-85.803145840000013,-147.9297009,-193.36890345]
[{"$f":"HLOOKUP(INDICE!$F$2,Nombres!$C$3:$E$853,56)","v":"Net income"},385.23606532999997,224.51398231000002,227.11219424999999,193.62149344999997,348.22786206000001,462.84653118999995]
[{"$f":"HLOOKUP(INDICE!$F$2,Nombres!$C$3:$E$853,57)","v":"Non-controlling interests"},-0.86899999999999999,-0.85957499999999998,-0.92912100000000009,-0.91599999999999993,-0.83504299999999998,-1.0490000000000002]
[{"$f":"HLOOKUP(INDICE!$F$2,Nombres!$C$3:$E$853,58)","v":"Net attributable profit"},384.36706533,223.65440731000001,226.18307325000001,192.70549345000001,347.39281906000002,461.79753118999997]
[{"$f":"HLOOKUP(INDICE!$F$2,Nombres!$C$3:$E$853,94)","v":"Balance sheet  "}]
[{"$f":"HLOOKUP(INDICE!$F$2,Nombres!$C$3:$E$853,30)","v":"(Million euros)"}]
[null,"2014-03-31","2014-06-30","2014-09-30","2014-12-31","2015-03-31","2015-06-30"]
[{"$f":"HLOOKUP(INDICE!$F$2,Nombres!$C$3:$E$853,100)","v":"Cash and balances with central banks"},4468.3791074600003,5835.3615392700003,829.72919295999998,7876.2097887600003,3902.2760986200001,7921.9088917500003]
[{"$f":"HLOOKUP(INDICE!$F$2,Nombres!$C$3:$E$853,101)","v":"Financial assets"},108376.84343969,112019.25883751,121611.69363081999,116016.06585664999,125945.47243682001,122871.70113897001]
[{"$f":"HLOOKUP(INDICE!$F$2,Nombres!$C$3:$E$853,102)","v":"Loans and receivables"},189842.09171675,195026.00084105998,190641.6535809999,191278.05562189,195471.77333097998,216897.33652239002]
[{"$f":"HLOOKUP(INDICE!$F$2,Nombres!$C$3:$E$853,103)","v":"  . Loans and advances to customers"},174565.79447774001,173369.98566877999,168774.0526376499,169215.57456459999,168212.04072135,187961.50955794001]
[{"$f":"HLOOKUP(INDICE!$F$2,Nombres!$C$3:$E$853,104)","v":"  . Loans and advances to credit institutions and other"},15276.29723901,21656.01517228,21867.60094335,22062.481057289999,27259.732609629998,28935.826964450003]
[{"$f":"HLOOKUP(INDICE!$F$2,Nombres!$C$3:$E$853,105)","v":"Inter-area positions"},8515.7650068557705,6521.2267507920042,4594.6430261749192,0,0,1260.4193399405922]
[{"$f":"HLOOKUP(INDICE!$F$2,Nombres!$C$3:$E$853,106)","v":"Tangible assets"},746.08893407000005,737.89761983000005,725.10536341,699.83059522999997,705.69388877999995,700.77091137000002]
[{"$f":"HLOOKUP(INDICE!$F$2,Nombres!$C$3:$E$853,107)","v":"Other assets"},1793.4190929598003,1664.8412667999,2216.8511115996998,2575.9262588599004,3499.9352535200001,2290.4142882000001]
[{"$f":"HLOOKUP(INDICE!$F$2,Nombres!$C$3:$E$853,108)","v":"Total assets / Liabilities and equity"},313742.58729778562,321804.58685526188,320619.67590596457,318446.08812138997,329525.15100872004,351942.55109262065]
[{"$f":"HLOOKUP(INDICE!$F$2,Nombres!$C$3:$E$853,109)","v":"Deposits from central banks and credit institutions"},57305.744961662596,54519.351111149997,53132.915473950001,64764.891638860005,58264.212331567898,61816.285598504299]
[{"$f":"HLOOKUP(INDICE!$F$2,Nombres!$C$3:$E$853,110)","v":"Deposits from customers"},156122.73763786739,162241.48718699001,160777.13669786,154261.31826525999,159815.62833488002,187967.68699510989]
[{"$f":"HLOOKUP(INDICE!$F$2,Nombres!$C$3:$E$853,111)","v":"Debt certificates"},48236.199898715102,48274.780764283503,44980.798059350695,41688.887677108702,39183.581542798202,43677.423985859597]
[{"$f":"HLOOKUP(INDICE!$F$2,Nombres!$C$3:$E$853,112)","v":"Subordinated liabilities"},2173.4543842014,2204.2107345073,2144.4676859142,2128.4431883354,2052.1183655028999,2201.6670272246001]
[{"$f":"HLOOKUP(INDICE!$F$2,Nombres!$C$3:$E$853,113)","v":"Inter-area positions"},0,0,0,44.986545213963836,5768.0784472445957,0]
[{"$f":"HLOOKUP(INDICE!$F$2,Nombres!$C$3:$E$853,114)","v":"Financial liabilities held for trading "},40193.268577950003,42694.393230789996,49105.890321660001,43977.070041080005,51937.853900030001,41361.214414980001]
[{"$f":"HLOOKUP(INDICE!$F$2,Nombres!$C$3:$E$853,115)","v":"Other liabilities"},1404.3831073690974,3647.1800776110017,2628.9364831097009,3422.302587861901,4638.0243267262995,6219.9778419122022]
[{"$f":"HLOOKUP(INDICE!$F$2,Nombres!$C$3:$E$853,116)","v":"Economic capital allocated"},8306.7987300200002,8223.18374993,7849.53118412,8158.1881776700002,7865.6537599699996,8698.29522903]
[{"$f":"HLOOKUP(INDICE!$F$2,Nombres!$C$3:$E$853,117)","v":"Relevant business indicators"}]
[{"$f":"HLOOKUP(INDICE!$F$2,Nombres!$C$3:$E$853,201)","v":"Annex:"}]
[{"$f":"HLOOKUP(INDICE!$F$2,Nombres!$C$3:$E$853,30)","v":"(Million euros)"},"2014-03-31","2014-06-30","2014-09-30","2014-12-31","2015-03-31","2015-06-30"]
[{"$f":"HLOOKUP(INDICE!$F$2,Nombres!$C$3:$E$853,118)","v":"Loans and advances to customers gross"},179562.65716756001,178656.38632640001,173757.40171005001,174201.43750351988,173233.67161831999,196614.5759881]
[{"$f":"HLOOKUP(INDICE!$F$2,Nombres!$C$3:$E$853,121)","v":"Customer deposits under management (*)"},135415.52187332738,141509.60913268002,139352.18084797001,138140.29478063001,136250.03044324002,159725.05555261989]
[{"$f":"HLOOKUP(INDICE!$F$2,Nombres!$C$3:$E$853,122)","v":"Mutual funds"},23783.227999999999,25752.17586476,27551.975864759999,28694.702999999998,30743.361999999997,32891.883999999998]
[{"$f":"HLOOKUP(INDICE!$F$2,Nombres!$C$3:$E$853,206)","v":"Pension funds"},20994.410000000003,21363.572,21676.718000000001,21879.792000000001,22595.352999999999,23106.303]
[{"$f":"HLOOKUP(INDICE!$F$2,Nombres!$C$3:$E$853,285)","v":"(*) Excluding repos. "}]

{"sheet":"Actividad inm. en España","index":4,"n_rows":43,"n_cols":7,"rows_kept":43,"cut":false,"hidden":false,"merged":[[3,1,3,4],[3,5,3,6]]}
[{"$f":"HLOOKUP(INDICE!$F$2,Nombres!$C$3:$E$853,279)","v":"Real-estate business in Spain"}]
[{"$f":"HLOOKUP(INDICE!$F$2,Nombres!$C$3:$E$853,93)","v":"Income statement  "}]
[{"$f":"HLOOKUP(INDICE!$F$2,Nombres!$C$3:$E$853,30)","v":"(Million euros)"}]
[null,2014,null,null,null,2015]
[null,{"$f":"HLOOKUP(INDICE!$F$2,Nombres!$C$3:$E$857,34)","v":"1st Quarter"},{"$f":"HLOOKUP(INDICE!$F$2,Nombres!$C$3:$E$857,35)","v":"2nd Quarter"},{"$f":"HLOOKUP(INDICE!$F$2,Nombres!$C$3:$E$857,36)","v":"3rd Quarter"},{"$f":"HLOOKUP(INDICE!$F$2,Nombres!$C$3:$E$857,37)","v":"4th Quarter"},{"$f":"HLOOKUP(INDICE!$F$2,Nombres!$C$3:$E$857,34)","v":"1st Quarter"},{"$f":"HLOOKUP(INDICE!$F$2,Nombres!$C$3:$E$857,35)","v":"2nd Quarter"}]
[{"$f":"HLOOKUP(INDICE!$F$2,Nombres!$C$3:$E$853,38)","v":"Net interest income"},-7.3170118699999982,-14.30579127,-8.7484138399999996,-8.0659005099999987,-9.4670519600000009,-4.5765528399999997]
[{"$f":"HLOOKUP(INDICE!$F$2,Nombres!$C$3:$E$853,39)","v":"Net fees and commissions"},1.4505388099999998,-0.77394092000000003,2.8978965200000002,1.06139936,1.23537381,-0.16756781000000004]
[{"$f":"HLOOKUP(INDICE!$F$2,Nombres!$C$3:$E$853,40)","v":"Net trading income"},4.2207629999999996E-2,1.6830000000000022E-3,1.93294242,-3.6683594899999994,0.71921942999999999,1.0527227300000002]
[{"$f":"HLOOKUP(INDICE!$F$2,Nombres!$C$3:$E$853,95)","v":"Other income/expenses"},-52.125888740000001,-45.22224293,-32.213872420000001,-54.77996538,-38.686077610000005,-6.1533183100000022]
[{"$f":"HLOOKUP(INDICE!$F$2,Nombres!$C$3:$E$853,44)","v":"Gross income"},-57.950154169999998,-60.300292120000002,-36.131447319999999,-65.452826020000003,-46.198536330000003,-9.8447162299999995]
[{"$f":"HLOOKUP(INDICE!$F$2,Nombres!$C$3:$E$853,45)","v":"Operating expenses"},-36.109033910000001,-39.085115189999996,-40.168763769999998,-37.633671470000003,-32.50525742,-36.526142460000003]
[{"$f":"HLOOKUP(INDICE!$F$2,Nombres!$C$3:$E$853,46)","v":"  Administration expenses"},-30.716251619999998,-32.915291490000001,-33.653925690000001,-32.668377989999996,-27.339490919999999,-29.8423409]
[{"$f":"HLOOKUP(INDICE!$F$2,Nombres!$C$3:$E$853,47)","v":"  Personnel expenses"},-18.398556129999999,-21.452683929999999,-20.84773899,-20.295229470000002,-18.34481967,-18.05342469]
[{"$f":"HLOOKUP(INDICE!$F$2,Nombres!$C$3:$E$853,48)","v":"  General and administrative expenses"},-12.31769549,-11.46260756,-12.806186700000001,-12.373148520000001,-8.9946712499999997,-11.78891621]
[{"$f":"HLOOKUP(INDICE!$F$2,Nombres!$C$3:$E$853,49)","v":"  Depreciation and amortization"},-5.3927822899999995,-6.1698236999999994,-6.5148380800000005,-4.9652934799999997,-5.1657665000000001,-6.68380156]
[{"$f":"HLOOKUP(INDICE!$F$2,Nombres!$C$3:$E$853,50)","v":"Operating income"},-94.059188079999998,-99.385407310000005,-76.300211090000005,-103.08649749,-78.703793750000003,-46.370858690000006]
[{"$f":"HLOOKUP(INDICE!$F$2,Nombres!$C$3:$E$853,51)","v":"Impairment on financial assets (net)"},-75.82084608000001,-50.205105180000004,-92.178420950000003,-79.28412904999999,-57.330779899999996,-58.472046759999998]
[{"$f":"HLOOKUP(INDICE!$F$2,Nombres!$C$3:$E$853,160)","v":"Provisions (net) and other gains/losses"},-183.19216410999999,-158.11883839000001,-120.60086228,-154.37542243000001,-84.720380349999999,-111.38776024000001]
[{"$f":"HLOOKUP(INDICE!$F$2,Nombres!$C$3:$E$853,54)","v":"Income before tax"},-353.07219827000006,-307.70935087999999,-289.07949431999998,-336.74604897,-220.754954,-216.23066569000002]
[{"$f":"HLOOKUP(INDICE!$F$2,Nombres!$C$3:$E$853,55)","v":"Income tax"},106.60805947,88.162953290000004,117.77444834000001,69.913561759999993,67.438686180000005,68.977499739999999]
[{"$f":"HLOOKUP(INDICE!$F$2,Nombres!$C$3:$E$853,56)","v":"Net income"},-246.4641388,-219.54639759000003,-171.30504598000002,-266.83248721000001,-153.31626782000001,-147.25316594999998]
[{"$f":"HLOOKUP(INDICE!$F$2,Nombres!$C$3:$E$853,57)","v":"Non-controlling interests"},1.427,-0.5,0.40799999999999997,1.4209999999999998,-0.50800000000000001,0.80400000000000016]
[{"$f":"HLOOKUP(INDICE!$F$2,Nombres!$C$3:$E$853,58)","v":"Net attributable profit"},-245.03713879999998,-220.04639759000003,-170.89704597999997,-265.41148720999996,-153.82426782000002,-146.44916595000001]
[{"$f":"HLOOKUP(INDICE!$F$2,Nombres!$C$3:$E$853,94)","v":"Balance sheet  "}]
[{"$f":"HLOOKUP(INDICE!$F$2,Nombres!$C$3:$E$853,30)","v":"(Million euros)"}]
[null,"2014-03-31","2014-06-30","2014-09-30","2014-12-31","2015-03-31","2015-06-30"]
[{"$f":"HLOOKUP(INDICE!$F$2,Nombres!$C$3:$E$853,100)","v":"Cash and balances with central banks"},5.1004065000000001,5.5763284999999998,5.52900262,5.9799869900000004,6.0896976199999999,6.8096796199999998]
[{"$f":"HLOOKUP(INDICE!$F$2,Nombres!$C$3:$E$853,101)","v":"Financial assets"},602.86160031999998,373.42798882,379.75575856,345.86104270999999,345.84389070999998,555.35901471]
[{"$f":"HLOOKUP(INDICE!$F$2,Nombres!$C$3:$E$853,102)","v":"Loans and receivables"},10067.15445799,9711.4264571200001,9364.6337533799997,8813.8633596300006,8776.6093235799999,8531.5996163700001]
[{"$f":"HLOOKUP(INDICE!$F$2,Nombres!$C$3:$E$853,103)","v":"  . Loans and advances to customers"},10067.15445799,9711.4264571200001,9364.6337533799997,8813.8633596300006,8776.6093235799999,8531.5996163700001]
[{"$f":"HLOOKUP(INDICE!$F$2,Nombres!$C$3:$E$853,104)","v":"  . Loans and advances to credit institutions and other"},0,0,0,0,0,0]
[{"$f":"HLOOKUP(INDICE!$F$2,Nombres!$C$3:$E$853,105)","v":"Inter-area positions"},0,0,0,0,0,0]
[{"$f":"HLOOKUP(INDICE!$F$2,Nombres!$C$3:$E$853,106)","v":"Tangible assets"},1600.0452249,1448.7829479100001,1429.54000741,1373.2818794499999,1279.3054546999999,1608.2906608999999]
[{"$f":"HLOOKUP(INDICE!$F$2,Nombres!$C$3:$E$853,107)","v":"Other assets"},7080.0219248000003,7255.54346945,7209.9447894699997,6826.2780076099998,6761.9045348,7216.69349556]
[{"$f":"HLOOKUP(INDICE!$F$2,Nombres!$C$3:$E$853,108)","v":"Total assets / Liabilities and equity"},19355.183614510002,18794.757191799999,18389.403311439997,17365.26427639,17169.75290141,17918.752467159997]
[{"$f":"HLOOKUP(INDICE!$F$2,Nombres!$C$3:$E$853,109)","v":"Deposits from central banks and credit institutions"},0,0,0,0,0,0]
[{"$f":"HLOOKUP(INDICE!$F$2,Nombres!$C$3:$E$853,110)","v":"Deposits from customers"},100.10953115,68.524568349999996,105.71797235,52.673648380000003,27.658391000000002,173.81181789999999]
[{"$f":"HLOOKUP(INDICE!$F$2,Nombres!$C$3:$E$853,111)","v":"Debt certificates"},0,0,0,0,0,0]
[{"$f":"HLOOKUP(INDICE!$F$2,Nombres!$C$3:$E$853,112)","v":"Subordinated liabilities"},911.89361062,875.96001153999998,900.52625822000005,870.64573243999996,775.65151185000002,869.61179039000001]
[{"$f":"HLOOKUP(INDICE!$F$2,Nombres!$C$3:$E$853,113)","v":"Inter-area positions"},14695.306451078002,14346.429061914399,13781.050388855097,12959.162506008,13263.833848547099,13421.873327901198]
[{"$f":"HLOOKUP(INDICE!$F$2,Nombres!$C$3:$E$853,114)","v":"Financial liabilities held for trading "},"0","0","0","0",0,"0"]
[{"$f":"HLOOKUP(INDICE!$F$2,Nombres!$C$3:$E$853,115)","v":"Other liabilities"},0.2959316619999563,-4.4001376431346273E-9,-3.5100188144898681E-8,-7.9997753352212264E-9,1.2899901320750917E-8,-3.1199964722894435E-8]
[{"$f":"HLOOKUP(INDICE!$F$2,Nombres!$C$3:$E$853,116)","v":"Economic capital allocated"},3647.57809,3503.8435500000001,3602.1086920500002,3482.7823895699999,3102.6091500000002,3453.4555310000001]

{"sheet":"Riesgo promoción inmobiliaria","index":5,"n_rows":20,"n_cols":4,"rows_kept":20,"cut":false,"hidden":false,"merged":[]}
[{"$f":"HLOOKUP(INDICE!$F$2,Nombres!$C$3:$E$853,262)","v":"Coverage of real estate exposure in Spain"}]
[{"$f":"HLOOKUP(INDICE!$F$2,Nombres!$C$3:$E$853,243)","v":"(Million of euros as of 30-Jun-15)"}]
[]
[]
[null,{"$f":"HLOOKUP(INDICE!$F$2,Nombres!$C$3:$E$853,244)","v":"Risk amount"},{"$f":"HLOOKUP(INDICE!$F$2,Nombres!$C$3:$E$853,245)","v":"Provision"},{"$f":"HLOOKUP(INDICE!$F$2,Nombres!$C$3:$E$853,246)","v":"% Coverage over risk"}]
[{"$f":"HLOOKUP(INDICE!$F$2,Nombres!$C$3:$E$853,247)","v":"NPL + Substandard"},8212,4533,55.199707744763757]
[{"$f":"HLOOKUP(INDICE!$F$2,Nombres!$C$3:$E$853,248)","v":"NPL"},7213,4212,58.394565368085402]
[{"$f":"HLOOKUP(INDICE!$F$2,Nombres!$C$3:$E$853,249)","v":"Substandard"},999,321,32.132132132132128]
[{"$f":"HLOOKUP(INDICE!$F$2,Nombres!$C$3:$E$853,250)","v":"Foreclosed real estate and other assets"},15223,8480,55.705182946856738]
[{"$f":"HLOOKUP(INDICE!$F$2,Nombres!$C$3:$E$853,251)","v":"From real estate developers"},9140,5323,58.238512035010935]
[{"$f":"HLOOKUP(INDICE!$F$2,Nombres!$C$3:$E$853,252)","v":"From dwellings"},4815,2540,52.751817237798548]
[{"$f":"HLOOKUP(INDICE!$F$2,Nombres!$C$3:$E$853,253)","v":"Other"},1268,617,48.65930599369085]
[{"$f":"HLOOKUP(INDICE!$F$2,Nombres!$C$3:$E$853,254)","v":"Subtotal"},23435,13013,55.528056326008112]
[{"$f":"HLOOKUP(INDICE!$F$2,Nombres!$C$3:$E$853,255)","v":"Performing"},2725,"-","-"]
[{"$f":"HLOOKUP(INDICE!$F$2,Nombres!$C$3:$E$853,256)","v":"With collateral"},2413]
[{"$f":"HLOOKUP(INDICE!$F$2,Nombres!$C$3:$E$853,257)","v":"Finished properties"},1880]
[{"$f":"HLOOKUP(INDICE!$F$2,Nombres!$C$3:$E$853,258)","v":"Construction in progress"},299]
[{"$f":"HLOOKUP(INDICE!$F$2,Nombres!$C$3:$E$853,259)","v":"Land"},234]
[{"$f":"HLOOKUP(INDICE!$F$2,Nombres!$C$3:$E$853,260)","v":"Without collateral and other"},312]
[{"$f":"HLOOKUP(INDICE!$F$2,Nombres!$C$3:$E$853,261)","v":"Real estate exposure"},26160,13013,49.743883792048933]

{"sheet":"Estados Unidos","index":6,"n_rows":102,"n_cols":7,"rows_kept":102,"cut":false,"hidden":false,"merged":[[3,1,3,4],[3,5,3,6],[53,1,53,4],[53,5,53,6]]}
[{"$f":"HLOOKUP(INDICE!$F$2,Nombres!$C$3:$E$853,20)","v":"The United States"}]
[{"$f":"HLOOKUP(INDICE!$F$2,Nombres!$C$3:$E$853,93)","v":"Income statement  "}]
[{"$f":"HLOOKUP(INDICE!$F$2,Nombres!$C$3:$E$853,30)","v":"(Million euros)"}]
[null,2014,null,null,null,2015]
[null,{"$f":"HLOOKUP(INDICE!$F$2,Nombres!$C$3:$E$857,34)","v":"1st Quarter"},{"$f":"HLOOKUP(INDICE!$F$2,Nombres!$C$3:$E$857,35)","v":"2nd Quarter"},{"$f":"HLOOKUP(INDICE!$F$2,Nombres!$C$3:$E$857,36)","v":"3rd Quarter"},{"$f":"HLOOKUP(INDICE!$F$2,Nombres!$C$3:$E$857,37)","v":"4th Quarter"},{"$f":"HLOOKUP(INDICE!$F$2,Nombres!$C$3:$E$857,34)","v":"1st Quarter"},{"$f":"HLOOKUP(INDICE!$F$2,Nombres!$C$3:$E$857,35)","v":"2nd Quarter"}]
[{"$f":"HLOOKUP(INDICE!$F$2,Nombres!$C$3:$E$853,38)","v":"Net interest income"},345.34143186,347.26771948999999,361.74554666,388.56140845000004,434.9317504,446.46030080000003]
[{"$f":"HLOOKUP(INDICE!$F$2,Nombres!$C$3:$E$853,39)","v":"Net fees and commissions"},132.99566440999999,135.01826684000002,136.12118593999998,149.32055228999999,155.91009808999999,161.40457663000001]
[{"$f":"HLOOKUP(INDICE!$F$2,Nombres!$C$3:$E$853,40)","v":"Net trading income"},36.850872449999997,37.567325629999999,33.063775379999996,37.261303310000002,55.806650050000002,61.642763549999998]
[{"$f":"HLOOKUP(INDICE!$F$2,Nombres!$C$3:$E$853,95)","v":"Other income/expenses"},2.1021965100000002,-0.53554945999999992,-2.2739817699999998,-3.2246465299999998,6.9636718200000001,8.8586987999999991]
[{"$f":"HLOOKUP(INDICE!$F$2,Nombres!$C$3:$E$853,44)","v":"Gross income"},517.29016522999996,519.31776250000007,528.65652621000004,571.91861752,653.61217035999994,678.36633977999998]
[{"$f":"HLOOKUP(INDICE!$F$2,Nombres!$C$3:$E$853,45)","v":"Operating expenses"},-351.26554152,-361.41302487000002,-381.44859229999997,-403.15437943999996,-430.67032977000002,-451.8660367]
[{"$f":"HLOOKUP(INDICE!$F$2,Nombres!$C$3:$E$853,46)","v":"  Administration expenses"},-307.78487727999999,-318.23279543000001,-336.68804722000004,-355.51091895000002,-378.70282073999999,-399.57165899999995]
[{"$f":"HLOOKUP(INDICE!$F$2,Nombres!$C$3:$E$853,47)","v":"  Personnel expenses"},-206.21145100999999,-207.49791112999998,-215.99092746000002,-231.12649232999999,-246.35778195,-261.81837951]
[{"$f":"HLOOKUP(INDICE!$F$2,Nombres!$C$3:$E$853,48)","v":"  General and administrative expenses"},-101.57342627,-110.7348843,-120.69711975999999,-124.38442662,-132.34503878999999,-137.75327949000001]
[{"$f":"HLOOKUP(INDICE!$F$2,Nombres!$C$3:$E$853,49)","v":"  Depreciation and amortization"},-43.480664239999996,-43.180229440000005,-44.76054508,-47.643460489999995,-51.967509030000002,-52.294377699999998]
[{"$f":"HLOOKUP(INDICE!$F$2,Nombres!$C$3:$E$853,50)","v":"Operating income"},166.02462371000001,157.90473763,147.20793391000001,168.76423807999998,222.94184059000003,226.50030307999998]
[{"$f":"HLOOKUP(INDICE!$F$2,Nombres!$C$3:$E$853,51)","v":"Impairment on financial assets (net)"},-19.346875439999998,-22.183915389999999,-11.70968373,-15.064388360000001,-29.687150920000001,-32.735266869999997]
[{"$f":"HLOOKUP(INDICE!$F$2,Nombres!$C$3:$E$853,160)","v":"Provisions (net) and other gains/losses"},-3.391,-12.741,-5.0903196399999997,10.951440220000002,-2.2080000000000002,5.6486305300000001]
[{"$f":"HLOOKUP(INDICE!$F$2,Nombres!$C$3:$E$853,54)","v":"Income before tax"},143.28674827,122.97982223999999,130.40793054,164.65128994000003,191.04668967000001,199.41366674]
[{"$f":"HLOOKUP(INDICE!$F$2,Nombres!$C$3:$E$853,55)","v":"Income tax"},-37.669454639999998,-32.591973510000003,-24.818161549999999,-37.810803870000001,-54.630857849999998,-49.81540743]
[{"$f":"HLOOKUP(INDICE!$F$2,Nombres!$C$3:$E$853,56)","v":"Net income"},105.61729363000001,90.387848730000002,105.58976899000001,126.84048607,136.41583181999999,149.59825931]
[{"$f":"HLOOKUP(INDICE!$F$2,Nombres!$C$3:$E$853,57)","v":"Non-controlling interests"},-1E-3,-1E-3,-1E-3,-1E-3,-1E-3,-2E-3]
[{"$f":"HLOOKUP(INDICE!$F$2,Nombres!$C$3:$E$853,58)","v":"Net attributable profit"},105.61629363,90.386848729999997,105.58876899000001,126.83948606999999,136.41483182000002,149.59625930999999]
[{"$f":"HLOOKUP(INDICE!$F$2,Nombres!$C$3:$E$853,94)","v":"Balance sheet  "}]
[{"$f":"HLOOKUP(INDICE!$F$2,Nombres!$C$3:$E$853,30)","v":"(Million euros)"}]
[null,"2014-03-31","2014-06-30","2014-09-30","2014-12-31","2015-03-31","2015-06-30"]
[{"$f":"HLOOKUP(INDICE!$F$2,Nombres!$C$3:$E$853,100)","v":"Cash and balances with central banks"},4478.5773062400003,3866.6367111200002,4233.0937560399998,3808.23050079,4838.9370026699999,4608.4817787299999]
[{"$f":"HLOOKUP(INDICE!$F$2,Nombres!$C$3:$E$853,101)","v":"Financial assets"},7358.0018285899996,7834.2011141800003,8906.8753815500004,11892.19928816,14179.31012677,14897.04780971]
[{"$f":"HLOOKUP(INDICE!$F$2,Nombres!$C$3:$E$853,102)","v":"Loans and receivables"},41079.960999460003,42369.50217467,46908.318890959999,50969.730156370002,59242.649006929998,58721.723772489997]
[{"$f":"HLOOKUP(INDICE!$F$2,Nombres!$C$3:$E$853,103)","v":"  . Loans and advances to customers"},39618.728365720002,40857.419084410001,45184.272038859999,48976.098561010003,57096.15649827,56413.845672000003]
[{"$f":"HLOOKUP(INDICE!$F$2,Nombres!$C$3:$E$853,104)","v":"  . Loans and advances to credit institutions and other"},1461.23263374,1512.0830902600001,1724.0468520999998,1993.6315953600001,2146.4925086599997,2307.8781004900002]
[{"$f":"HLOOKUP(INDICE!$F$2,Nombres!$C$3:$E$853,105)","v":"Inter-area positions"},0,8.944924080002238,723.61973817999387,0,0,100.40761531001772]
[{"$f":"HLOOKUP(INDICE!$F$2,Nombres!$C$3:$E$853,106)","v":"Tangible assets"},657.53561150999997,653.41392438000003,705.06631009,724.76428475,810.94961962000002,768.53848299000003]
[{"$f":"HLOOKUP(INDICE!$F$2,Nombres!$C$3:$E$853,107)","v":"Other assets"},2179.5319649500002,2112.1299308299999,2543.1918024299998,1866.1958546999999,1858.2568237400001,1712.9662783900001]
[{"$f":"HLOOKUP(INDICE!$F$2,Nombres!$C$3:$E$853,108)","v":"Total assets / Liabilities and equity"},55753.60771075001,56844.828779260002,64020.165879249995,69261.120084770009,80930.10257973001,80809.165737620002]
[{"$f":"HLOOKUP(INDICE!$F$2,Nombres!$C$3:$E$853,109)","v":"Deposits from central banks and credit institutions"},3682.8404240199998,4761.1949211299998,5081.6089288599997,5765.3249268600002,7548.2599239600004,7805.8008176100002]
[{"$f":"HLOOKUP(INDICE!$F$2,Nombres!$C$3:$E$853,110)","v":"Deposits from customers"},42535.89442592,44024.405609870002,48820.521361450003,51394.095885169998,59337.183222150001,57568.712793810002]
[{"$f":"HLOOKUP(INDICE!$F$2,Nombres!$C$3:$E$853,111)","v":"Debt certificates"},0,0,790.30200000000002,821.92100000000005,925.822,895.822]
[{"$f":"HLOOKUP(INDICE!$F$2,Nombres!$C$3:$E$853,112)","v":"Subordinated liabilities"},651.27616771999999,651.42261167000004,711.58875927999998,741.79042130000005,846.00219244000004,1404.79710834]
[{"$f":"HLOOKUP(INDICE!$F$2,Nombres!$C$3:$E$853,113)","v":"Inter-area positions"},1668.7715331400104,0,0,344.79671552999935,223.41553900000872,0]
[{"$f":"HLOOKUP(INDICE!$F$2,Nombres!$C$3:$E$853,114)","v":"Financial liabilities held for trading "},177.67469152999999,182.822,367.48028278999999,2341.1796915300001,3492.0793874699998,4580.68035564]
[{"$f":"HLOOKUP(INDICE!$F$2,Nombres!$C$3:$E$853,115)","v":"Other liabilities"},4750.7074996700003,4833.6307137500007,5788.2307121000003,5299.9336877000005,5634.8665547099999,5623.8870222199994]
[{"$f":"HLOOKUP(INDICE!$F$2,Nombres!$C$3:$E$853,116)","v":"Economic capital allocated"},2286.4429687500001,2391.3529228399998,2460.43383477,2552.0777566800002,2922.4737599999999,2929.4656399999999]
[{"$f":"HLOOKUP(INDICE!$F$2,Nombres!$C$3:$E$853,117)","v":"Relevant business indicators"}]
[{"$f":"HLOOKUP(INDICE!$F$2,Nombres!$C$3:$E$853,201)","v":"Annex:"}]
[{"$f":"HLOOKUP(INDICE!$F$2,Nombres!$C$3:$E$853,30)","v":"(Million euros)"},"2014-03-31","2014-06-30","2014-09-30","2014-12-31","2015-03-31","2015-06-30"]
[{"$f":"HLOOKUP(INDICE!$F$2,Nombres!$C$3:$E$853,118)","v":"Loans and advances to customers gross"},40255.168965620003,41496.616145710002,45854.984444969996,49666.930051650001,57877.592292060006,57175.81282988]
[{"$f":"HLOOKUP(INDICE!$F$2,Nombres!$C$3:$E$853,121)","v":"Customer deposits under management (*)"},39541.260910379999,42428.69990023,47691.067746790002,50093.342606359998,58423.984330250001,56457.662059369999]
[{"$f":"HLOOKUP(INDICE!$F$2,Nombres!$C$3:$E$853,122)","v":"Mutual funds"},"0","0","0","0","0","0"]
[{"$f":"HLOOKUP(INDICE!$F$2,Nombres!$C$3:$E$853,206)","v":"Pension funds"},"0","0","0","0","0","0"]
[{"$f":"HLOOKUP(INDICE!$F$2,Nombres!$C$3:$E$853,298)","v":"(*) Excluding repos."}]
[{"$f":"HLOOKUP(INDICE!$F$2,Nombres!$C$3:$E$853,93)","v":"Income statement  "}]
[{"$f":"HLOOKUP(INDICE!$F$2,Nombres!$C$3:$E$853,31)","v":"(Constant million euros)    "}]
[null,2014,null,null,null,2015]
[null,{"$f":"HLOOKUP(INDICE!$F$2,Nombres!$C$3:$E$857,34)","v":"1st Quarter"},{"$f":"HLOOKUP(INDICE!$F$2,Nombres!$C$3:$E$857,35)","v":"2nd Quarter"},{"$f":"HLOOKUP(INDICE!$F$2,Nombres!$C$3:$E$857,36)","v":"3rd Quarter"},{"$f":"HLOOKUP(INDICE!$F$2,Nombres!$C$3:$E$857,37)","v":"4th Quarter"},{"$f":"HLOOKUP(INDICE!$F$2,Nombres!$C$3:$E$857,34)","v":"1st Quarter"},{"$f":"HLOOKUP(INDICE!$F$2,Nombres!$C$3:$E$857,35)","v":"2nd Quarter"}]
[{"$f":"HLOOKUP(INDICE!$F$2,Nombres!$C$3:$E$853,38)","v":"Net interest income"},424.02590507540003,426.80197660559998,428.66064909840003,436.62467640630001,438.87220369199997,442.51984750790001]
[{"$f":"HLOOKUP(INDICE!$F$2,Nombres!$C$3:$E$853,39)","v":"Net fees and commissions"},163.3062203719,165.90247101809999,160.6103029402,167.44797154470001,157.15914762649999,160.15552709350001]
[{"$f":"HLOOKUP(INDICE!$F$2,Nombres!$C$3:$E$853,40)","v":"Net trading income"},45.280558122900004,46.031599412600002,37.571521077299998,40.515459524999997,56.224009439900001,61.225404159999997]
[{"$f":"HLOOKUP(INDICE!$F$2,Nombres!$C$3:$E$853,95)","v":"Other income/expenses"},2.5790392812,-0.64455709880000001,-2.6556594978000003,-3.8481904241000002,6.9775537245999999,8.844816895400001]
[{"$f":"HLOOKUP(INDICE!$F$2,Nombres!$C$3:$E$853,44)","v":"Gross income"},635.19172285140007,638.09148993739996,624.18681361819995,640.73991705200001,659.23291448309999,672.74559565699997]
[{"$f":"HLOOKUP(INDICE!$F$2,Nombres!$C$3:$E$853,45)","v":"Operating expenses"},-431.31393617380002,-444.08558534039997,-450.65055879869999,-451.96590657679997,-434.08234369950003,-448.45402277049999]
[{"$f":"HLOOKUP(INDICE!$F$2,Nombres!$C$3:$E$853,46)","v":"  Administration expenses"},-377.9272029,-391.01309766899999,-397.59419133259996,-398.45475740459995,-381.64296636250003,-396.63151337750003]
[{"$f":"HLOOKUP(INDICE!$F$2,Nombres!$C$3:$E$853,47)","v":"  Personnel expenses"},-253.21264764709997,-254.9420300223,-254.88392968140002,-259.05501484850004,-248.3332696855,-259.8428917745]
[{"$f":"HLOOKUP(INDICE!$F$2,Nombres!$C$3:$E$853,48)","v":"  General and administrative expenses"},-124.7145552529,-136.07106764669999,-142.71026165130002,-139.39974255600001,-133.30969667700001,-136.78862160300002]
[{"$f":"HLOOKUP(INDICE!$F$2,Nombres!$C$3:$E$853,49)","v":"  Depreciation and amortization"},-53.386733273899999,-53.072487671399998,-53.056367466200001,-53.511149172200007,-52.43937733700001,-51.822509393000004]
[{"$f":"HLOOKUP(INDICE!$F$2,Nombres!$C$3:$E$853,50)","v":"Operating income"},203.87778667749998,194.00590459710003,173.53625481949999,188.77401047520001,225.1505707837,224.29157288639999]
[{"$f":"HLOOKUP(INDICE!$F$2,Nombres!$C$3:$E$853,51)","v":"Impairment on financial assets (net)"},-23.735032963400002,-27.3134767285,-14.2838345694,-16.4052796818,-29.7658310805,-32.656586709500004]
[{"$f":"HLOOKUP(INDICE!$F$2,Nombres!$C$3:$E$853,160)","v":"Provisions (net) and other gains/losses"},-4.1634175633999995,-15.655282741999999,-5.9510803363000004,13.517412437400003,-2.2290061451999996,5.6696366752999996]
[{"$f":"HLOOKUP(INDICE!$F$2,Nombres!$C$3:$E$853,54)","v":"Income before tax"},175.9793361509,151.03714512670001,153.30133991370002,185.8861432308,193.1557335576,197.30462285229999]
[{"$f":"HLOOKUP(INDICE!$F$2,Nombres!$C$3:$E$853,55)","v":"Income tax"},-46.253446961799995,-40.059599238299995,-29.104402383399997,-43.057648992200001,-55.137606317900008,-49.308658962000003]
[{"$f":"HLOOKUP(INDICE!$F$2,Nombres!$C$3:$E$853,56)","v":"Net income"},129.7258891891,110.9775458883,124.19693753040001,142.8284942386,138.01812723969999,147.9959638903]
[{"$f":"HLOOKUP(INDICE!$F$2,Nombres!$C$3:$E$853,57)","v":"Non-controlling interests"},-1.2277846E-3,-1.2292821E-3,-1.1870174E-3,-1.1188793999999998E-3,-1.0095137000000001E-3,-1.9904862999999997E-3]
[{"$f":"HLOOKUP(INDICE!$F$2,Nombres!$C$3:$E$853,58)","v":"Net attributable profit"},129.72466140450001,110.976316606,124.1957505128,142.82737535929999,138.0171177261,147.99397340389999]
[{"$f":"HLOOKUP(INDICE!$F$2,Nombres!$C$3:$E$853,94)","v":"Balance sheet  "}]
[{"$f":"HLOOKUP(INDICE!$F$2,Nombres!$C$3:$E$853,31)","v":"(Constant million euros)    "}]
[null,"2014-03-31","2014-06-30","2014-09-30","2014-12-31","2015-03-31","2015-06-30"]
[{"$f":"HLOOKUP(INDICE!$F$2,Nombres!$C$3:$E$853,100)","v":"Cash and balances with central banks"},5518.8720428756997,4719.8589416323002,4760.4813854064996,4132.2506226800997,4652.9762226868997,4608.4817787299999]
[{"$f":"HLOOKUP(INDICE!$F$2,Nombres!$C$3:$E$853,101)","v":"Financial assets"},9067.1362369149992,9562.9165452676007,10016.554534258599,12904.037164593999,13634.3979757457,14897.04780971]
[{"$f":"HLOOKUP(INDICE!$F$2,Nombres!$C$3:$E$853,102)","v":"Loans and receivables"},50622.113403393501,51718.868006532197,52752.476503149097,55306.447215525099,56965.948729263197,58721.723772489997]
[{"$f":"HLOOKUP(INDICE!$F$2,Nombres!$C$3:$E$853,103)","v":"  . Loans and advances to customers"},48821.462129773798,49873.124683005102,50813.636160839102,53143.189135529203,54901.946118884101,56413.845672000003]
[{"$f":"HLOOKUP(INDICE!$F$2,Nombres!$C$3:$E$853,104)","v":"  . Loans and advances to credit institutions and other"},1800.6512736196999,1845.7433235271999,1938.8403423099999,2163.2580799959997,2064.0026103790997,2307.8781004900002]
[{"$f":"HLOOKUP(INDICE!$F$2,Nombres!$C$3:$E$853,105)","v":"Inter-area positions"},0,10.918734563427279,813.77320991380839,0,0,100.40761531001772]
[{"$f":"HLOOKUP(INDICE!$F$2,Nombres!$C$3:$E$853,106)","v":"Tangible assets"},810.26956897709999,797.59796018659995,792.90826948289998,786.43025056730005,779.78475351240002,768.53848299000003]
[{"$f":"HLOOKUP(INDICE!$F$2,Nombres!$C$3:$E$853,107)","v":"Other assets"},2685.7989056384999,2578.1980787716002,2860.0399454210001,2024.9795754294,1786.8438485017,1712.9662783900001]
[{"$f":"HLOOKUP(INDICE!$F$2,Nombres!$C$3:$E$853,108)","v":"Total assets / Liabilities and equity"},68704.19015779969,69388.358266953612,71996.233847631898,75154.144828796008,77819.951529709797,80809.165737620002]
[{"$f":"HLOOKUP(INDICE!$F$2,Nombres!$C$3:$E$853,109)","v":"Deposits from central banks and credit institutions"},4538.2994787603002,5811.8127200113004,5714.7103532107003,6255.8627987534001,7258.1796228111998,7805.8008176100002]
[{"$f":"HLOOKUP(INDICE!$F$2,Nombres!$C$3:$E$853,110)","v":"Deposits from customers"},52416.2345570873,53738.946788100497,54902.914171322001,55766.919749084802,57056.849986172798,57568.712793810002]
[{"$f":"HLOOKUP(INDICE!$F$2,Nombres!$C$3:$E$853,111)","v":"Debt certificates"},0,0,888.76320173190004,891.85346405350003,890.24257808350001,895.822]
[{"$f":"HLOOKUP(INDICE!$F$2,Nombres!$C$3:$E$853,112)","v":"Subordinated liabilities"},802.55616648909995,795.16723917449997,800.24332978300004,804.90504177180003,813.49025283699996,1404.79710834]
[{"$f":"HLOOKUP(INDICE!$F$2,Nombres!$C$3:$E$853,113)","v":"Inter-area positions"},2056.3978090454038,0,0,374.13345703510277,214.8296599380119,0]
[{"$f":"HLOOKUP(INDICE!$F$2,Nombres!$C$3:$E$853,114)","v":"Financial liabilities held for trading "},218.94539733529999,223.16398355850001,413.26347738689998,2540.3770166023,3357.8784655943,4580.68035564]
[{"$f":"HLOOKUP(INDICE!$F$2,Nombres!$C$3:$E$853,115)","v":"Other liabilities"},5854.2132938687009,5900.2323852228001,6509.3678872748005,5750.8741334376991,5418.3181311541002,5623.8870222199994]
[{"$f":"HLOOKUP(INDICE!$F$2,Nombres!$C$3:$E$853,116)","v":"Economic capital allocated"},2817.5434552134998,2919.0351508858998,2766.9714269225001,2769.2191680575002,2810.1628331187999,2929.4656399999999]
[{"$f":"HLOOKUP(INDICE!$F$2,Nombres!$C$3:$E$853,117)","v":"Relevant business indicators"}]
[{"$f":"HLOOKUP(INDICE!$F$2,Nombres!$C$3:$E$853,201)","v":"Annex:"}]
[{"$f":"HLOOKUP(INDICE!$F$2,Nombres!$C$3:$E$853,31)","v":"(Constant million euros)    "}]
[null,"2014-03-31","2014-06-30","2014-09-30","2014-12-31","2015-03-31","2015-06-30"]
[{"$f":"HLOOKUP(INDICE!$F$2,Nombres!$C$3:$E$853,118)","v":"Loans and advances to customers gross"},49605.736686974204,50653.368649697302,51567.9104831812,53892.799448447899,55653.351265521698,57175.81282988]
[{"$f":"HLOOKUP(INDICE!$F$2,Nombres!$C$3:$E$853,121)","v":"Customer deposits under management (*)"},48726.000347097201,51791.128457974402,53632.745538605697,54355.492960396201,56178.745409020798,56457.662059369999]
[{"$f":"HLOOKUP(INDICE!$F$2,Nombres!$C$3:$E$853,122)","v":"Mutual funds"},"0","0","0","0","0","0"]
[{"$f":"HLOOKUP(INDICE!$F$2,Nombres!$C$3:$E$853,206)","v":"Pension funds"},"0","0","0","0","0","0"]
[{"$f":"HLOOKUP(INDICE!$F$2,Nombres!$C$3:$E$853,298)","v":"(*) Excluding repos."}]

{"sheet":"Turquía","index":7,"n_rows":101,"n_cols":7,"rows_kept":101,"cut":false,"hidden":false,"merged":[[72,0,72,6],[91,0,91,6],[3,1,3,4],[3,5,3,6],[52,1,52,4],[52,5,52,6],[23,0,23,6],[41,0,41,6]]}
[{"$f":"HLOOKUP(INDICE!$F$2,Nombres!$C$3:$E$853,295)","v":"Turkey"}]
[{"$f":"HLOOKUP(INDICE!$F$2,Nombres!$C$3:$E$853,304)","v":"Income statement (*)"}]
[{"$f":"HLOOKUP(INDICE!$F$2,Nombres!$C$3:$E$853,30)","v":"(Million euros)"}]
[null,2014,null,null,null,2015]
[null,{"$f":"HLOOKUP(INDICE!$F$2,Nombres!$C$3:$E$857,34)","v":"1st Quarter"},{"$f":"HLOOKUP(INDICE!$F$2,Nombres!$C$3:$E$857,35)","v":"2nd Quarter"},{"$f":"HLOOKUP(INDICE!$F$2,Nombres!$C$3:$E$857,36)","v":"3rd Quarter"},{"$f":"HLOOKUP(INDICE!$F$2,Nombres!$C$3:$E$857,37)","v":"4th Quarter"},{"$f":"HLOOKUP(INDICE!$F$2,Nombres!$C$3:$E$857,34)","v":"1st Quarter"},{"$f":"HLOOKUP(INDICE!$F$2,Nombres!$C$3:$E$857,35)","v":"2nd Quarter"}]
[{"$f":"HLOOKUP(INDICE!$F$2,Nombres!$C$3:$E$853,38)","v":"Net interest income"},146.34886950000001,167.27188501000001,196.55727318000001,224.46315089000001,210.40501202999999,214.60152532000001]
[{"$f":"HLOOKUP(INDICE!$F$2,Nombres!$C$3:$E$853,39)","v":"Net fees and commissions"},41.73,52.956000000000003,47.693999999999996,48.449999999999996,49.620999999999995,48.449999999999996]
[{"$f":"HLOOKUP(INDICE!$F$2,Nombres!$C$3:$E$853,40)","v":"Net trading income"},17.852,8.0510000000000002,-2.7030000000000003,-21.917000000000002,-14.707000000000001,-7.0299999999999994]
[{"$f":"HLOOKUP(INDICE!$F$2,Nombres!$C$3:$E$853,95)","v":"Other income/expenses"},3.7839999999999998,3.6260000000000003,4.3250000000000002,5.9110000000000005,4.7380000000000004,4.2690000000000001]
[{"$f":"HLOOKUP(INDICE!$F$2,Nombres!$C$3:$E$853,44)","v":"Gross income"},209.71486949999999,231.90488501000002,245.87327318000001,256.90715089000003,250.05701203000001,260.29052531999997]
[{"$f":"HLOOKUP(INDICE!$F$2,Nombres!$C$3:$E$853,45)","v":"Operating expenses"},-91.783929000000001,-94.406953000000001,-101.82176263740001,-106.6560903626,-109.90620700000001,-111.40645599999999]
[{"$f":"HLOOKUP(INDICE!$F$2,Nombres!$C$3:$E$853,46)","v":"  Administration expenses"},-83.521676999999997,-85.716701,-92.8525056374,-97.385829362599992,-100.33795500000001,-102.403205]
[{"$f":"HLOOKUP(INDICE!$F$2,Nombres!$C$3:$E$853,47)","v":"  Personnel expenses"},-46.930352999999997,-50.525183999999996,-52.746526000000003,-51.644427,-56.248039999999996,-55.285052999999998]
[{"$f":"HLOOKUP(INDICE!$F$2,Nombres!$C$3:$E$853,48)","v":"  General and administrative expenses"},-36.591324,-35.191516999999997,-40.105979637399997,-45.741402362599999,-44.089914999999998,-47.118152000000002]
[{"$f":"HLOOKUP(INDICE!$F$2,Nombres!$C$3:$E$853,49)","v":"  Depreciation and amortization"},-8.2622520000000002,-8.690252000000001,-8.9692569999999989,-9.2702609999999996,-9.5682520000000011,-9.0032510000000006]
[{"$f":"HLOOKUP(INDICE!$F$2,Nombres!$C$3:$E$853,50)","v":"Operating income"},117.93094049999999,137.49793201,144.0515105426,150.2510605274,140.15080502999999,148.88406932000001]
[{"$f":"HLOOKUP(INDICE!$F$2,Nombres!$C$3:$E$853,51)","v":"Impairment on financial assets (net)"},-25.16,-25.331000000000003,-50.100999999999999,-45.805,-33.067999999999998,-37.912999999999997]
[{"$f":"HLOOKUP(INDICE!$F$2,Nombres!$C$3:$E$853,160)","v":"Provisions (net) and other gains/losses"},-4.5600000000000005,-4.3740000000000006,6.8929999999999998,-9.0239999999999991,-0.47799999999999987,1.0269999999999997]
[{"$f":"HLOOKUP(INDICE!$F$2,Nombres!$C$3:$E$853,54)","v":"Income before tax"},88.210940499999992,107.79293201000002,100.8435105426,95.422060527399992,106.60480502999999,111.99806932]
[{"$f":"HLOOKUP(INDICE!$F$2,Nombres!$C$3:$E$853,55)","v":"Income tax"},-18.557582149999998,-22.917379599999997,-19.907787159999998,-20.399074159999998,-20.910441509999998,-23.258720789999998]
[{"$f":"HLOOKUP(INDICE!$F$2,Nombres!$C$3:$E$853,56)","v":"Net income"},69.653358349999991,84.875552409999997,80.935723382600003,75.022986367399994,85.694363519999996,88.739348530000001]
[{"$f":"HLOOKUP(INDICE!$F$2,Nombres!$C$3:$E$853,57)","v":"Non-controlling interests"},"0","0","0","0","0","0"]
[{"$f":"HLOOKUP(INDICE!$F$2,Nombres!$C$3:$E$853,58)","v":"Net attributable profit"},69.653358349999991,84.875552409999997,80.935723382600003,75.022986367399994,85.694363519999996,88.739348530000001]
[{"$f":"HLOOKUP(INDICE!$F$2,Nombres!$C$3:$E$853,289)","v":"(*) Financial statements with the revenues and expenses of the Garanti Group consolidated in proportion to the percentage of the Group's stake."}]
[{"$f":"HLOOKUP(INDICE!$F$2,Nombres!$C$3:$E$853,293)","v":"Balance sheet (*)  "}]
[{"$f":"HLOOKUP(INDICE!$F$2,Nombres!$C$3:$E$853,30)","v":"(Million euros)"},"2014-03-31","2014-06-30","2014-09-30","2014-12-31","2015-03-31","2015-06-30"]
[{"$f":"HLOOKUP(INDICE!$F$2,Nombres!$C$3:$E$853,100)","v":"Cash and balances with central banks"},2023.8420000000001,2205.8809999999999,2226.152,2478.34,2430.1469999999999,2316.5509999999999]
[{"$f":"HLOOKUP(INDICE!$F$2,Nombres!$C$3:$E$853,101)","v":"Financial assets"},3847.7910000000002,4122.3959999999997,4282.2110000000002,4508.1210000000001,4469.3050000000003,4298.3500000000004]
[{"$f":"HLOOKUP(INDICE!$F$2,Nombres!$C$3:$E$853,102)","v":"Loans and receivables"},12747.96,13095.614,13997.549000000001,14464.214,15748.941000000001,15036.8]
[{"$f":"HLOOKUP(INDICE!$F$2,Nombres!$C$3:$E$853,103)","v":"  . Loans and advances to customers"},11334.891,11823.876,12633.233,13097.802,14176.656000000001,13796.26]
[{"$f":"HLOOKUP(INDICE!$F$2,Nombres!$C$3:$E$853,104)","v":"  . Loans and advances to credit institutions and other"},1413.069,1271.7379999999998,1364.3159999999998,1366.412,1572.2849999999999,1240.54]
[{"$f":"HLOOKUP(INDICE!$F$2,Nombres!$C$3:$E$853,106)","v":"Tangible assets"},175.142,180.999,181.238,194.404,192.62200000000001,182.77]
[{"$f":"HLOOKUP(INDICE!$F$2,Nombres!$C$3:$E$853,107)","v":"Other assets"},635.71299999999997,618.89999999999986,669.11000000000013,697.22199999999998,779.40499999999997,664.51600000000008]
[{"$f":"HLOOKUP(INDICE!$F$2,Nombres!$C$3:$E$853,108)","v":"Total assets / Liabilities and equity"},19430.447999999997,20223.79,21356.260000000006,22342.300999999996,23620.42,22498.987000000001]
[{"$f":"HLOOKUP(INDICE!$F$2,Nombres!$C$3:$E$853,109)","v":"Deposits from central banks and credit institutions"},4407.1009999999997,4218.8,4619.1540000000005,4373.9040000000005,4348.66,4230.7110000000002]
[{"$f":"HLOOKUP(INDICE!$F$2,Nombres!$C$3:$E$853,110)","v":"Deposits from customers"},10132.687,10354.254000000001,10709.601000000001,11625.644,12507.075999999999,12018.362999999999]
[{"$f":"HLOOKUP(INDICE!$F$2,Nombres!$C$3:$E$853,111)","v":"Debt certificates"},940.41499999999996,1139.0139999999999,1291.1489999999999,1297.318,1306.1030000000001,1257.7339999999999]
[{"$f":"HLOOKUP(INDICE!$F$2,Nombres!$C$3:$E$853,112)","v":"Subordinated liabilities"},23.295999999999999,23.667000000000002,23.154,23.353999999999999,22.931999999999999,22.875]
[{"$f":"HLOOKUP(INDICE!$F$2,Nombres!$C$3:$E$853,114)","v":"Financial liabilities held for trading "},165.523,119.95399999999999,167.76599999999999,191.74600000000001,372.90800000000002,241.804]
[{"$f":"HLOOKUP(INDICE!$F$2,Nombres!$C$3:$E$853,115)","v":"Other liabilities"},2972.8192699999918,3547.5556199999992,3684.7637486900071,3912.6794688299947,4119.981060000001,3725.3404000000046]
[{"$f":"HLOOKUP(INDICE!$F$2,Nombres!$C$3:$E$853,116)","v":"Economic capital allocated"},788.60672999999997,820.54538000000002,860.67225130999998,917.65553117000002,942.75994000000003,1002.1596]
[{"$f":"HLOOKUP(INDICE!$F$2,Nombres!$C$3:$E$853,289)","v":"(*) Financial statements with the revenues and expenses of the Garanti Group consolidated in proportion to the percentage of the Group's stake."}]
[{"$f":"HLOOKUP(INDICE!$F$2,Nombres!$C$3:$E$853,117)","v":"Relevant business indicators"}]
[{"$f":"HLOOKUP(INDICE!$F$2,Nombres!$C$3:$E$853,201)","v":"Annex:"}]
[{"$f":"HLOOKUP(INDICE!$F$2,Nombres!$C$3:$E$853,30)","v":"(Million euros)"},"2014-03-31","2014-06-30","2014-09-30","2014-12-31","2015-03-31","2015-06-30"]
[{"$f":"HLOOKUP(INDICE!$F$2,Nombres!$C$3:$E$853,118)","v":"Loans and advances to customers gross"},11775.187,12270.794,13117.258,13634.606,14741.394,14355.491]
[{"$f":"HLOOKUP(INDICE!$F$2,Nombres!$C$3:$E$853,121)","v":"Customer deposits under management (*)"},10168.332947700001,9995.3233460400006,10500.35512713,10980.6973499,12056.610480650001,11644.38746365]
[{"$f":"HLOOKUP(INDICE!$F$2,Nombres!$C$3:$E$853,122)","v":"Mutual funds"},350.24700000000001,373.54899999999998,340.44600000000003,343.76100000000002,365.12599999999998,352.35899999999998]
[{"$f":"HLOOKUP(INDICE!$F$2,Nombres!$C$3:$E$853,206)","v":"Pension funds"},384.97699999999998,444.32499999999999,470.173,537.91899999999998,572.24800000000005,563.24800000000005]
[{"$f":"HLOOKUP(INDICE!$F$2,Nombres!$C$3:$E$853,297)","v":"(*) Including repos."}]
[{"$f":"HLOOKUP(INDICE!$F$2,Nombres!$C$3:$E$853,304)","v":"Income statement (*)"}]
[{"$f":"HLOOKUP(INDICE!$F$2,Nombres!$C$3:$E$853,31)","v":"(Constant million euros)    "}]
[null,2014,null,null,null,2015]
[null,{"$f":"HLOOKUP(INDICE!$F$2,Nombres!$C$3:$E$857,34)","v":"1st Quarter"},{"$f":"HLOOKUP(INDICE!$F$2,Nombres!$C$3:$E$857,35)","v":"2nd Quarter"},{"$f":"HLOOKUP(INDICE!$F$2,Nombres!$C$3:$E$857,36)","v":"3rd Quarter"},{"$f":"HLOOKUP(INDICE!$F$2,Nombres!$C$3:$E$857,37)","v":"4th Quarter"},{"$f":"HLOOKUP(INDICE!$F$2,Nombres!$C$3:$E$857,34)","v":"1st Quarter"},{"$f":"HLOOKUP(INDICE!$F$2,Nombres!$C$3:$E$857,35)","v":"2nd Quarter"}]
[{"$f":"HLOOKUP(INDICE!$F$2,Nombres!$C$3:$E$853,38)","v":"Net interest income"},155.2929448587,169.87729587389998,197.65457783400001,223.15223575209995,203.8496808818,221.1568564682]
[{"$f":"HLOOKUP(INDICE!$F$2,Nombres!$C$3:$E$853,39)","v":"Net fees and commissions"},44.280299041399999,53.892587056500005,47.736513150599997,47.865150385999996,48.075026563400002,49.995973436599996]
[{"$f":"HLOOKUP(INDICE!$F$2,Nombres!$C$3:$E$853,40)","v":"Net trading income"},18.943012185300002,7.9138860743000006,-3.0818030033000001,-22.472298278799997,-14.248794173299999,-7.4882058269000007]
[{"$f":"HLOOKUP(INDICE!$F$2,Nombres!$C$3:$E$853,95)","v":"Other income/expenses"},4.0152564480000006,3.6676226048,4.3430150348000005,5.8923876441000003,4.5903846327000002,4.4166153673000004]
[{"$f":"HLOOKUP(INDICE!$F$2,Nombres!$C$3:$E$853,44)","v":"Gross income"},222.53151253339999,235.35139160950001,246.65230301599999,254.43747550340001,242.26629790480001,268.08123944529996]
[{"$f":"HLOOKUP(INDICE!$F$2,Nombres!$C$3:$E$853,45)","v":"Operating expenses"},-97.323144294100004,-95.681059964900001,-102.10061538719999,-105.60753751450001,-106.5151660941,-114.79749690579999]
[{"$f":"HLOOKUP(INDICE!$F$2,Nombres!$C$3:$E$853,46)","v":"  Administration expenses"},-88.555966085500003,-86.871463498400004,-93.113084056399998,-96.436816509599993,-97.245011146499991,-105.4961488533]
[{"$f":"HLOOKUP(INDICE!$F$2,Nombres!$C$3:$E$853,47)","v":"  Personnel expenses"},-49.733420717100003,-51.272747811299993,-52.877247768299995,-51.036527428599996,-54.526099574200003,-57.006993425799998]
[{"$f":"HLOOKUP(INDICE!$F$2,Nombres!$C$3:$E$853,48)","v":"  General and administrative expenses"},-38.8225453684,-35.598715687099997,-40.235836288100003,-45.400289080999997,-42.718911572399996,-48.489155427499995]
[{"$f":"HLOOKUP(INDICE!$F$2,Nombres!$C$3:$E$853,49)","v":"  Depreciation and amortization"},-8.7671782085000007,-8.8095964664000004,-8.9875313307999996,-9.1707210049000008,-9.2701549475,-9.3013480524999999]
[{"$f":"HLOOKUP(INDICE!$F$2,Nombres!$C$3:$E$853,50)","v":"Operating income"},125.20836823920001,139.6703316446,144.55168762879998,148.82993798889999,135.75113181060001,153.28374253940001]
[{"$f":"HLOOKUP(INDICE!$F$2,Nombres!$C$3:$E$853,51)","v":"Impairment on financial assets (net)"},-26.6976353674,-25.652735246799999,-50.735163092899995,-45.570404787200005,-32.037745680200004,-38.943254319800005]
[{"$f":"HLOOKUP(INDICE!$F$2,Nombres!$C$3:$E$853,160)","v":"Provisions (net) and other gains/losses"},-4.8386811317999996,-4.4243204144000003,7.1714080367999999,-9.1441419185000008,-0.46310760960000008,1.0121076095000003]
[{"$f":"HLOOKUP(INDICE!$F$2,Nombres!$C$3:$E$853,54)","v":"Income before tax"},93.672051740000001,109.59327598350001,100.9879325726,94.115391283299999,103.25027852080001,115.35259582930001]
[{"$f":"HLOOKUP(INDICE!$F$2,Nombres!$C$3:$E$853,55)","v":"Income tax"},-19.712764332600003,-23.3025830984,-19.9032280644,-20.1390802108,-20.249007519099997,-23.920154780799997]
[{"$f":"HLOOKUP(INDICE!$F$2,Nombres!$C$3:$E$853,56)","v":"Net income"},73.959287407399998,86.290692884999999,81.084704508200005,73.976311072399994,83.001271001500001,91.432441048499996]
[{"$f":"HLOOKUP(INDICE!$F$2,Nombres!$C$3:$E$853,57)","v":"Non-controlling interests"},"0","0","0","0","0","0"]
[{"$f":"HLOOKUP(INDICE!$F$2,Nombres!$C$3:$E$853,58)","v":"Net attributable profit"},73.959287407399998,86.290692884999999,81.084704508200005,73.976311072399994,83.001271001500001,91.432441048499996]
[{"$f":"HLOOKUP(INDICE!$F$2,Nombres!$C$3:$E$853,289)","v":"(*) Financial statements with the revenues and expenses of the Garanti Group consolidated in proportion to the percentage of the Group's stake."}]
[{"$f":"HLOOKUP(INDICE!$F$2,Nombres!$C$3:$E$853,293)","v":"Balance sheet (*)  "}]
[{"$f":"HLOOKUP(INDICE!$F$2,Nombres!$C$3:$E$853,31)","v":"(Constant million euros)    "}]
[null,"2014-03-31","2014-06-30","2014-09-30","2014-12-31","2015-03-31","2015-06-30"]
[{"$f":"HLOOKUP(INDICE!$F$2,Nombres!$C$3:$E$853,100)","v":"Cash and balances with central banks"},2006.2705468020999,2133.4096389482002,2138.8936275081001,2343.2236660275998,2282.3201216158,2316.5509999999999]
[{"$f":"HLOOKUP(INDICE!$F$2,Nombres!$C$3:$E$853,101)","v":"Financial assets"},3814.3917884196999,3987.0487277584002,4114.5136622846003,4262.6222963407999,4197.7914938224003,4298.3500000000004]
[{"$f":"HLOOKUP(INDICE!$F$2,Nombres!$C$3:$E$853,102)","v":"Loans and receivables"},12637.279332976999,12665.374576210101,13448.8877474818,13675.6411772749,14790.926202588,15036.8]
[{"$f":"HLOOKUP(INDICE!$F$2,Nombres!$C$3:$E$853,103)","v":"  . Loans and advances to customers"},11236.4789170853,11435.417879807799,12138.048775880899,12383.724436253,13314.2839696636,13796.26]
[{"$f":"HLOOKUP(INDICE!$F$2,Nombres!$C$3:$E$853,104)","v":"  . Loans and advances to credit institutions and other"},1400.8004158916999,1229.9566964024,1310.8389716009999,1291.9167410219,1476.6422329244999,1240.54]
[{"$f":"HLOOKUP(INDICE!$F$2,Nombres!$C$3:$E$853,106)","v":"Tangible assets"},173.62137761150001,175.05251246099999,174.13402286199999,183.80531063960001,180.9047215933,182.77]
[{"$f":"HLOOKUP(INDICE!$F$2,Nombres!$C$3:$E$853,107)","v":"Other assets"},630.19359619929992,598.56684270139988,642.88292762660012,659.21023381580005,731.99346146059997,664.51600000000008]
[{"$f":"HLOOKUP(INDICE!$F$2,Nombres!$C$3:$E$853,108)","v":"Total assets / Liabilities and equity"},19261.756642009597,19559.452298079093,20519.311987763198,21124.502684098698,22183.936001080099,22498.987000000001]
[{"$f":"HLOOKUP(INDICE!$F$2,Nombres!$C$3:$E$853,109)","v":"Deposits from central banks and credit institutions"},4368.8375540589996,4080.1967942943002,4438.0972436196998,4135.4436299026002,4084.1291576459998,4230.7110000000002]
[{"$f":"HLOOKUP(INDICE!$F$2,Nombres!$C$3:$E$853,110)","v":"Deposits from customers"},10044.7127236534,10014.0784057335,10289.817286534901,10991.826849266699,11746.265233082,12018.362999999999]
[{"$f":"HLOOKUP(INDICE!$F$2,Nombres!$C$3:$E$853,111)","v":"Debt certificates"},932.25010463800004,1101.5931713891,1240.5398949682999,1226.5896688765999,1226.652197502,1257.7339999999999]
[{"$f":"HLOOKUP(INDICE!$F$2,Nombres!$C$3:$E$853,112)","v":"Subordinated liabilities"},23.093738868100001,22.8894513915,22.2464337796,22.0807659548,21.5370366603,22.875]
[{"$f":"HLOOKUP(INDICE!$F$2,Nombres!$C$3:$E$853,114)","v":"Financial liabilities held for trading "},164.08589194129999,116.0130668111,161.1900841957,181.29222183639999,350.22384732760003,241.804]
[{"$f":"HLOOKUP(INDICE!$F$2,Nombres!$C$3:$E$853,115)","v":"Other liabilities"},2947.0167672206976,3431.075615173494,3540.462029657896,3699.6114440436968,3869.6810512470001,3725.3404000000046]
[{"$f":"HLOOKUP(INDICE!$F$2,Nombres!$C$3:$E$853,116)","v":"Economic capital allocated"},781.75986162900006,793.60579328610004,826.95901500720004,867.65810421799995,885.4474776152,1002.1596]
[{"$f":"HLOOKUP(INDICE!$F$2,Nombres!$C$3:$E$853,289)","v":"(*) Financial statements with the revenues and expenses of the Garanti Group consolidated in proportion to the percentage of the Group's stake."}]
[{"$f":"HLOOKUP(INDICE!$F$2,Nombres!$C$3:$E$853,117)","v":"Relevant business indicators"}]
[{"$f":"HLOOKUP(INDICE!$F$2,Nombres!$C$3:$E$853,201)","v":"Annex:"}]
[{"$f":"HLOOKUP(INDICE!$F$2,Nombres!$C$3:$E$853,31)","v":"(Constant million euros)    "}]
[null,"2014-03-31","2014-06-30","2014-09-30","2014-12-31","2015-03-31","2015-06-30"]
[{"$f":"HLOOKUP(INDICE!$F$2,Nombres!$C$3:$E$853,118)","v":"Loans and advances to customers gross"},11672.9521678009,11867.6529682008,12603.1014713189,12891.262480596601,13844.6687162822,14355.491]
[{"$f":"HLOOKUP(INDICE!$F$2,Nombres!$C$3:$E$853,121)","v":"Customer deposits under management (*)"},10080.049185187199,9666.9399531731997,10088.7732140439,10382.041971550299,11323.201723382101,11644.38746365]
[{"$f":"HLOOKUP(INDICE!$F$2,Nombres!$C$3:$E$853,122)","v":"Mutual funds"},347.20607646529999,361.27653178909998,327.10155457069999,325.01953350119999,342.91522970630001,352.35899999999998]
[{"$f":"HLOOKUP(INDICE!$F$2,Nombres!$C$3:$E$853,206)","v":"Pension funds"},381.63454276380003,429.72727804700003,451.74365161330002,508.5922557865,537.43791011589997,563.24800000000005]
[{"$f":"HLOOKUP(INDICE!$F$2,Nombres!$C$3:$E$853,297)","v":"(*) Including repos."}]

{"sheet":"México","index":8,"n_rows":99,"n_cols":7,"rows_kept":99,"cut":false,"hidden":false,"merged":[[3,1,3,4],[3,5,3,6],[51,1,51,4],[51,5,51,6]]}
[{"$f":"HLOOKUP(INDICE!$F$2,Nombres!$C$3:$E$853,9)","v":"Mexico"}]
[{"$f":"HLOOKUP(INDICE!$F$2,Nombres!$C$3:$E$853,93)","v":"Income statement  "}]
[{"$f":"HLOOKUP(INDICE!$F$2,Nombres!$C$3:$E$853,30)","v":"(Million euros)"}]
[null,2014,null,null,null,2015]
[null,{"$f":"HLOOKUP(INDICE!$F$2,Nombres!$C$3:$E$857,34)","v":"1st Quarter"},{"$f":"HLOOKUP(INDICE!$F$2,Nombres!$C$3:$E$857,35)","v":"2nd Quarter"},{"$f":"HLOOKUP(INDICE!$F$2,Nombres!$C$3:$E$857,36)","v":"3rd Quarter"},{"$f":"HLOOKUP(INDICE!$F$2,Nombres!$C$3:$E$857,37)","v":"4th Quarter"},{"$f":"HLOOKUP(INDICE!$F$2,Nombres!$C$3:$E$857,34)","v":"1st Quarter"},{"$f":"HLOOKUP(INDICE!$F$2,Nombres!$C$3:$E$857,35)","v":"2nd Quarter"}]
[{"$f":"HLOOKUP(INDICE!$F$2,Nombres!$C$3:$E$853,38)","v":"Net interest income"},1172.6951419100001,1181.3981738299999,1232.7636235499999,1323.55857971,1340.3771765199999,1393.4643517]
[{"$f":"HLOOKUP(INDICE!$F$2,Nombres!$C$3:$E$853,39)","v":"Net fees and commissions"},262.01400457,297.97400040000002,302.05513836,303.94969006999997,295.11765385000001,309.60095422999996]
[{"$f":"HLOOKUP(INDICE!$F$2,Nombres!$C$3:$E$853,40)","v":"Net trading income"},48.448978030000006,59.467708529999996,55.668369040000002,31.766891309999998,51.942804140000007,57.484435680000004]
[{"$f":"HLOOKUP(INDICE!$F$2,Nombres!$C$3:$E$853,95)","v":"Other income/expenses"},53.53275206,58.640973540000005,55.854762960000002,82.111964130000004,64.212608860000003,45.469974620000002]
[{"$f":"HLOOKUP(INDICE!$F$2,Nombres!$C$3:$E$853,44)","v":"Gross income"},1536.69087657,1597.4808562999999,1646.3418939099997,1741.3871252200001,1751.6502433699998,1806.0197162300001]
[{"$f":"HLOOKUP(INDICE!$F$2,Nombres!$C$3:$E$853,45)","v":"Operating expenses"},-567.56908724999994,-586.93718613999999,-617.39127126000005,-634.56400030999998,-646.72280568999997,-662.47228629000006]
[{"$f":"HLOOKUP(INDICE!$F$2,Nombres!$C$3:$E$853,46)","v":"  Administration expenses"},-523.98837075000006,-542.70871855999997,-569.74083267000003,-582.77316885000005,-592.41684379000003,-608.72188013000005]
[{"$f":"HLOOKUP(INDICE!$F$2,Nombres!$C$3:$E$853,47)","v":"  Personnel expenses"},-244.26564548000002,-254.00511219999999,-265.67318500000005,-256.37710708999998,-287.81489001,-292.35707563]
[{"$f":"HLOOKUP(INDICE!$F$2,Nombres!$C$3:$E$853,48)","v":"  General and administrative expenses"},-279.72272526999996,-288.70360635999998,-304.06764767000004,-326.39606176000001,-304.60195378000003,-316.36480449999999]
[{"$f":"HLOOKUP(INDICE!$F$2,Nombres!$C$3:$E$853,49)","v":"  Depreciation and amortization"},-43.580716500000001,-44.22846758,-47.65043859,-51.790831460000007,-54.3059619,-53.750406160000004]
[{"$f":"HLOOKUP(INDICE!$F$2,Nombres!$C$3:$E$853,50)","v":"Operating income"},969.12178932000006,1010.54367016,1028.9506226499998,1106.8231249099999,1104.9274376799999,1143.54742994]
[{"$f":"HLOOKUP(INDICE!$F$2,Nombres!$C$3:$E$853,51)","v":"Impairment on financial assets (net)"},-355.43361687999999,-394.96267798999997,-396.21081185000003,-370.64715236000001,-421.86768575000008,-429.76270519000002]
[{"$f":"HLOOKUP(INDICE!$F$2,Nombres!$C$3:$E$853,160)","v":"Provisions (net) and other gains/losses"},-16.087999830000001,-25.494001019999999,-43.767999289999999,6.6240006299999976,10.37400083,-26.870638249999999]
[{"$f":"HLOOKUP(INDICE!$F$2,Nombres!$C$3:$E$853,54)","v":"Income before tax"},597.60017261000007,590.08699115000002,588.97181150999995,742.79997318000005,693.43375276000006,686.91408649999994]
[{"$f":"HLOOKUP(INDICE!$F$2,Nombres!$C$3:$E$853,55)","v":"Income tax"},-143.72496473000001,-143.37294134000001,-140.51005241000001,-175.99982081000002,-169.58439347000001,-169.05025959]
[{"$f":"HLOOKUP(INDICE!$F$2,Nombres!$C$3:$E$853,56)","v":"Net income"},453.87520788,446.71404981000001,448.46175909999999,566.80015236999998,523.84935929000005,517.86382690999994]
[{"$f":"HLOOKUP(INDICE!$F$2,Nombres!$C$3:$E$853,57)","v":"Non-controlling interests"},-0.14499999999999999,-0.13799999999999998,-0.13900000000000001,-0.17399999999999999,-0.16400000000000001,-0.16299999999999998]
[{"$f":"HLOOKUP(INDICE!$F$2,Nombres!$C$3:$E$853,58)","v":"Net attributable profit"},453.73020787999997,446.57604980999997,448.32275909999998,566.62615237,523.68535928999995,517.70082690999993]
[{"$f":"HLOOKUP(INDICE!$F$2,Nombres!$C$3:$E$853,94)","v":"Balance sheet  "}]
[{"$f":"HLOOKUP(INDICE!$F$2,Nombres!$C$3:$E$853,30)","v":"(Million euros)"}]
[null,"2014-03-31","2014-06-30","2014-09-30","2014-12-31","2015-03-31","2015-06-30"]
[{"$f":"HLOOKUP(INDICE!$F$2,Nombres!$C$3:$E$853,100)","v":"Cash and balances with central banks"},5298.7435213600002,4442.4611275400002,4888.5786617200001,6004.1734723,6328.3115172099997,5326.4556505299997]
[{"$f":"HLOOKUP(INDICE!$F$2,Nombres!$C$3:$E$853,101)","v":"Financial assets"},32502.395393589999,34870.235104740001,37888.280866169996,34311.300632229999,37896.320647840002,35355.609344049997]
[{"$f":"HLOOKUP(INDICE!$F$2,Nombres!$C$3:$E$853,102)","v":"Loans and receivables"},42672.863102900003,43942.023027160001,46078.475219059997,47800.076362879998,51672.297989990002,50340.092902520002]
[{"$f":"HLOOKUP(INDICE!$F$2,Nombres!$C$3:$E$853,103)","v":"  . Loans and advances to customers"},40381.055399049998,41504.047758610002,44869.056695159998,45223.713459619998,49986.859236470002,48006.040030620003]
[{"$f":"HLOOKUP(INDICE!$F$2,Nombres!$C$3:$E$853,104)","v":"  . Loans and advances to credit institutions and other"},2291.8077038500001,2437.9752685499998,1209.4185239000001,2576.3629032600002,1685.4387535200001,2334.0528718999999]
[{"$f":"HLOOKUP(INDICE!$F$2,Nombres!$C$3:$E$853,106)","v":"Tangible assets"},1333.0714861599999,1410.8360059300001,1566.3091462,1662.12129114,1898.0046650100001,1898.72807741]
[{"$f":"HLOOKUP(INDICE!$F$2,Nombres!$C$3:$E$853,107)","v":"Other assets"},3681.8737708699969,3813.0630064099814,3391.9593029499729,3952.9017752900181,4504.6929190099963,3934.5687472599861]
[{"$f":"HLOOKUP(INDICE!$F$2,Nombres!$C$3:$E$853,108)","v":"Total assets / Liabilities and equity"},85488.947274880018,88478.618271779997,93813.603196099983,93730.573533840012,102299.62773906,96855.454721770016]
[{"$f":"HLOOKUP(INDICE!$F$2,Nombres!$C$3:$E$853,109)","v":"Deposits from central banks and credit institutions"},9366.2657944000002,8617.1685771400007,11411.538662430001,11617.07061904,9241.1327790800005,8851.0170856299992]
[{"$f":"HLOOKUP(INDICE!$F$2,Nombres!$C$3:$E$853,110)","v":"Deposits from customers"},44341.9797817,46030.330859610003,48334.198945290002,45937.425730479998,50963.076128139997,50497.327835919998]
[{"$f":"HLOOKUP(INDICE!$F$2,Nombres!$C$3:$E$853,111)","v":"Debt certificates"},3882.7719999999999,4345.4849999999997,4586.8680000000004,5032.5739999999996,6188.79,5447.7560000000003]
[{"$f":"HLOOKUP(INDICE!$F$2,Nombres!$C$3:$E$853,112)","v":"Subordinated liabilities"},3638.23999998,3770.49,3712.9990000100001,4128.1230000200003,4683.3580000000002,4465.6559999999999]
[{"$f":"HLOOKUP(INDICE!$F$2,Nombres!$C$3:$E$853,114)","v":"Financial liabilities held for trading "},6890.4229999999998,7291.1030000000001,6824.7979999999998,7615.9660000000003,7860.9009999999998,7251.9390000000003]
[{"$f":"HLOOKUP(INDICE!$F$2,Nombres!$C$3:$E$853,115)","v":"Other liabilities"},12806.96383755,13627.419967869999,14028.670972190001,14420.724252880002,18320.92464184,15091.78614022]
[{"$f":"HLOOKUP(INDICE!$F$2,Nombres!$C$3:$E$853,116)","v":"Economic capital allocated"},4562.3028612500002,4796.6208671599998,4914.5296161799997,4978.68993142,5041.4451900000004,5249.9726600000004]
[{"$f":"HLOOKUP(INDICE!$F$2,Nombres!$C$3:$E$853,117)","v":"Relevant business indicators"}]
[{"$f":"HLOOKUP(INDICE!$F$2,Nombres!$C$3:$E$853,201)","v":"Annex:"}]
[{"$f":"HLOOKUP(INDICE!$F$2,Nombres!$C$3:$E$853,30)","v":"(Million euros)"},"2014-03-31","2014-06-30","2014-09-30","2014-12-31","2015-03-31","2015-06-30"]
[{"$f":"HLOOKUP(INDICE!$F$2,Nombres!$C$3:$E$853,118)","v":"Loans and advances to customers gross"},41988.385172009999,43156.838932009996,46582.416289110006,46798.19096906,51700.19953066,49626.615872750001]
[{"$f":"HLOOKUP(INDICE!$F$2,Nombres!$C$3:$E$853,121)","v":"Customer deposits under management (*)"},41311.401387329999,43908.011621520003,46225.86240464,44437.14150913,50250.7017165,47325.992472240003]
[{"$f":"HLOOKUP(INDICE!$F$2,Nombres!$C$3:$E$853,122)","v":"Mutual funds"},17191.113939999999,18362.39992,20027.190189000001,18691.020986,20797.48302068,20260.315936629999]
[{"$f":"HLOOKUP(INDICE!$F$2,Nombres!$C$3:$E$853,206)","v":"Pension funds"},"0","0","0","0","0","0"]
[{"$f":"HLOOKUP(INDICE!$F$2,Nombres!$C$3:$E$853,287)","v":"(*) Including all the repos."}]
[{"$f":"HLOOKUP(INDICE!$F$2,Nombres!$C$3:$E$853,93)","v":"Income statement  "}]
[{"$f":"HLOOKUP(INDICE!$F$2,Nombres!$C$3:$E$853,31)","v":"(Constant million euros)    "}]
[null,2014,null,null,null,2015]
[null,{"$f":"HLOOKUP(INDICE!$F$2,Nombres!$C$3:$E$857,34)","v":"1st Quarter"},{"$f":"HLOOKUP(INDICE!$F$2,Nombres!$C$3:$E$857,35)","v":"2nd Quarter"},{"$f":"HLOOKUP(INDICE!$F$2,Nombres!$C$3:$E$857,36)","v":"3rd Quarter"},{"$f":"HLOOKUP(INDICE!$F$2,Nombres!$C$3:$E$857,37)","v":"4th Quarter"},{"$f":"HLOOKUP(INDICE!$F$2,Nombres!$C$3:$E$857,34)","v":"1st Quarter"},{"$f":"HLOOKUP(INDICE!$F$2,Nombres!$C$3:$E$857,35)","v":"2nd Quarter"}]
[{"$f":"HLOOKUP(INDICE!$F$2,Nombres!$C$3:$E$853,38)","v":"Net interest income"},1259.1834815396001,1247.0366244807001,1269.5328592746,1359.6723234742999,1335.8436174899,1397.9979107301001]
[{"$f":"HLOOKUP(INDICE!$F$2,Nombres!$C$3:$E$853,39)","v":"Net fees and commissions"},281.33800055580002,314.83768534500001,311.26556690929999,311.9808225717,294.1194771218,310.59913095820002]
[{"$f":"HLOOKUP(INDICE!$F$2,Nombres!$C$3:$E$853,40)","v":"Net trading income"},52.022175800500001,62.868329101399993,57.3094933733,32.103552918999995,51.767117943000002,57.660121877099996]
[{"$f":"HLOOKUP(INDICE!$F$2,Nombres!$C$3:$E$853,95)","v":"Other income/expenses"},57.480887151499999,61.941756201800004,57.454794100299999,84.725190983399997,63.995422490499998,45.687160989500001]
[{"$f":"HLOOKUP(INDICE!$F$2,Nombres!$C$3:$E$853,44)","v":"Gross income"},1650.0245450476,1686.6843951289,1695.5627136575999,1788.4818899483998,1745.7256350451999,1811.9443245548]
[{"$f":"HLOOKUP(INDICE!$F$2,Nombres!$C$3:$E$853,45)","v":"Operating expenses"},-609.42831069779993,-619.68474762940002,-636.09860794449992,-651.52106777519998,-644.53539451409995,-664.65969746579992]
[{"$f":"HLOOKUP(INDICE!$F$2,Nombres!$C$3:$E$853,46)","v":"  Administration expenses"},-562.63343932049997,-572.99600849590001,-586.98883359750005,-598.28362859130004,-590.41311172199994,-610.72561219789998]
[{"$f":"HLOOKUP(INDICE!$F$2,Nombres!$C$3:$E$853,47)","v":"  Personnel expenses"},-262.28066861010001,-268.18946304940005,-273.70568458139996,-262.89936331929999,-286.84141342709995,-293.33055221289999]
[{"$f":"HLOOKUP(INDICE!$F$2,Nombres!$C$3:$E$853,48)","v":"  General and administrative expenses"},-300.35277071029998,-304.80654544650002,-313.28314901609997,-335.38426527199999,-303.57169829500003,-317.39505998509998]
[{"$f":"HLOOKUP(INDICE!$F$2,Nombres!$C$3:$E$853,49)","v":"  Depreciation and amortization"},-46.794871377299998,-46.688739133299997,-49.1097743471,-53.237439183900008,-54.122282792199996,-53.9340852678]
[{"$f":"HLOOKUP(INDICE!$F$2,Nombres!$C$3:$E$853,50)","v":"Operating income"},1040.5962343497999,1066.9996474995,1059.4641057131998,1136.9608221732999,1101.190240531,1147.2846270889002]
[{"$f":"HLOOKUP(INDICE!$F$2,Nombres!$C$3:$E$853,51)","v":"Impairment on financial assets (net)"},-381.64747440689996,-417.24111217200004,-408.10273102940005,-379.78802141570003,-420.4408022655,-431.18958867449999]
[{"$f":"HLOOKUP(INDICE!$F$2,Nombres!$C$3:$E$853,160)","v":"Provisions (net) and other gains/losses"},-17.274518255399997,-26.994604757699996,-45.575696997999998,7.5113622412000005,10.338912836900001,-26.8355502569]
[{"$f":"HLOOKUP(INDICE!$F$2,Nombres!$C$3:$E$853,54)","v":"Income before tax"},641.67424168740001,622.76393056979998,605.78567768569997,764.6841629987,691.0883511024,689.25948815750007]
[{"$f":"HLOOKUP(INDICE!$F$2,Nombres!$C$3:$E$853,55)","v":"Income tax"},-154.3249349342,-151.32588178499998,-144.4764240774,-181.1396331105,-169.01080801080002,-169.62384504919999]
[{"$f":"HLOOKUP(INDICE!$F$2,Nombres!$C$3:$E$853,56)","v":"Net income"},487.34930675340001,471.43804878489993,461.30925360820004,583.54452988820003,522.07754309170002,519.63564310829997]
[{"$f":"HLOOKUP(INDICE!$F$2,Nombres!$C$3:$E$853,57)","v":"Non-controlling interests"},-0.15569400629999999,-0.1455940885,-0.14293585349999999,-0.1790865354,-0.16344530260000001,-0.1635546974]
[{"$f":"HLOOKUP(INDICE!$F$2,Nombres!$C$3:$E$853,58)","v":"Net attributable profit"},487.19361274699997,471.2924546964,461.1663177547,583.36544335279996,521.91409778909997,519.47208841099996]
[]
[{"$f":"HLOOKUP(INDICE!$F$2,Nombres!$C$3:$E$853,94)","v":"Balance sheet  "}]
[{"$f":"HLOOKUP(INDICE!$F$2,Nombres!$C$3:$E$853,31)","v":"(Constant million euros)    "}]
[null,"2014-03-31","2014-06-30","2014-09-30","2014-12-31","2015-03-31","2015-06-30"]
[{"$f":"HLOOKUP(INDICE!$F$2,Nombres!$C$3:$E$853,100)","v":"Cash and balances with central banks"},5444.3133983203998,4487.8630204620003,4739.3395313899,6118.8584853774,5959.8627397842001,5326.4556505299997]
[{"$f":"HLOOKUP(INDICE!$F$2,Nombres!$C$3:$E$853,101)","v":"Financial assets"},33395.318343963401,35226.608438110597,36731.622770342299,34966.676760162198,35689.9101426587,35355.609344049997]
[{"$f":"HLOOKUP(INDICE!$F$2,Nombres!$C$3:$E$853,102)","v":"Loans and receivables"},43845.194506825799,44391.109910979299,44671.785863219899,48713.100013523603,48663.818560774802,50340.092902520002]
[{"$f":"HLOOKUP(INDICE!$F$2,Nombres!$C$3:$E$853,103)","v":"  . Loans and advances to customers"},41490.425052870101,41928.218568003103,43499.2886166893,46087.526304710504,47076.509908225897,48006.040030620003]
[{"$f":"HLOOKUP(INDICE!$F$2,Nombres!$C$3:$E$853,104)","v":"  . Loans and advances to credit institutions and other"},2354.7694539558001,2462.8913429762001,1172.4972465305,2625.5737088131,1587.3086525489,2334.0528718999999]
[{"$f":"HLOOKUP(INDICE!$F$2,Nombres!$C$3:$E$853,106)","v":"Tangible assets"},1369.6943291864,1425.2547309188999,1518.4926680409001,1693.8692749198999,1787.4984902634999,1898.72807741]
[{"$f":"HLOOKUP(INDICE!$F$2,Nombres!$C$3:$E$853,107)","v":"Other assets"},3783.0241491905226,3852.0324590065006,3288.4091523812885,4028.4056883406924,4242.4193893053989,3934.5687472599861]
[{"$f":"HLOOKUP(INDICE!$F$2,Nombres!$C$3:$E$853,108)","v":"Total assets / Liabilities and equity"},87837.5447274865,89382.868559477312,90949.649985374504,95520.910222323786,96343.50932278682,96855.454721770016]
[{"$f":"HLOOKUP(INDICE!$F$2,Nombres!$C$3:$E$853,109)","v":"Deposits from central banks and credit institutions"},9623.5807887517003,8705.2359239998004,11063.1658073413,11838.9669220053,8703.0928824628008,8851.0170856299992]
[{"$f":"HLOOKUP(INDICE!$F$2,Nombres!$C$3:$E$853,110)","v":"Deposits from customers"},45560.166039438998,46500.760221365497,46858.646578243002,46814.871109922598,47995.889218613702,50497.327835919998]
[{"$f":"HLOOKUP(INDICE!$F$2,Nombres!$C$3:$E$853,111)","v":"Debt certificates"},3989.4415604395999,4389.8957982040001,4446.8395298396999,5128.7006055461998,5828.4644845693001,5447.7560000000003]
[{"$f":"HLOOKUP(INDICE!$F$2,Nombres!$C$3:$E$853,112)","v":"Subordinated liabilities"},3738.1916483311002,3809.0243570441999,3599.6481101047002,4206.9737931269001,4410.6821804461997,4465.6559999999999]
[{"$f":"HLOOKUP(INDICE!$F$2,Nombres!$C$3:$E$853,114)","v":"Financial liabilities held for trading "},7079.7203351648004,7365.6179745119998,6616.4497276946004,7761.4376730514996,7403.2213559055999,7251.9390000000003]
[{"$f":"HLOOKUP(INDICE!$F$2,Nombres!$C$3:$E$853,115)","v":"Other liabilities"},13158.803503416799,13766.692016498298,13600.4019802291,14696.172814977199,17254.238485945396,15091.78614022]
[{"$f":"HLOOKUP(INDICE!$F$2,Nombres!$C$3:$E$853,116)","v":"Economic capital allocated"},4687.6408519437,4845.6422678535,4764.4982519221003,5073.787303694,4747.9207148436999,5249.9726600000004]
[{"$f":"HLOOKUP(INDICE!$F$2,Nombres!$C$3:$E$853,117)","v":"Relevant business indicators"}]
[{"$f":"HLOOKUP(INDICE!$F$2,Nombres!$C$3:$E$853,201)","v":"Annex:"}]
[{"$f":"HLOOKUP(INDICE!$F$2,Nombres!$C$3:$E$853,31)","v":"(Constant million euros)    "}]
[null,"2014-03-31","2014-06-30","2014-09-30","2014-12-31","2015-03-31","2015-06-30"]
[{"$f":"HLOOKUP(INDICE!$F$2,Nombres!$C$3:$E$853,118)","v":"Loans and advances to customers gross"},43141.9122371751,43597.901244946501,45160.342558334705,47692.077724338706,48690.0956099006,49626.615872750001]
[{"$f":"HLOOKUP(INDICE!$F$2,Nombres!$C$3:$E$853,121)","v":"Customer deposits under management (*)"},42446.329996872002,44356.750909231501,44814.673594680396,45285.930135675801,47324.990875325297,47325.992472240003]
[{"$f":"HLOOKUP(INDICE!$F$2,Nombres!$C$3:$E$853,122)","v":"Mutual funds"},17663.397290000001,18550.063399999999,19415.797664999998,19048.035984999999,19586.605968931901,20260.315936629999]
[{"$f":"HLOOKUP(INDICE!$F$2,Nombres!$C$3:$E$853,206)","v":"Pension funds"},"0","0","0","0","0","0"]
[{"$f":"HLOOKUP(INDICE!$F$2,Nombres!$C$3:$E$853,287)","v":"(*) Including all the repos."}]

{"sheet":"América del sur","index":9,"n_rows":99,"n_cols":7,"rows_kept":99,"cut":false,"hidden":false,"merged":[[3,1,3,4],[3,5,3,6],[51,1,51,4],[51,5,51,6]]}
[{"$f":"HLOOKUP(INDICE!$F$2,Nombres!$C$3:$E$853,12)","v":"South America"}]
[{"$f":"HLOOKUP(INDICE!$F$2,Nombres!$C$3:$E$853,93)","v":"Income statement  "}]
[{"$f":"HLOOKUP(INDICE!$F$2,Nombres!$C$3:$E$853,30)","v":"(Million euros)"}]
[null,2014,null,null,null,2015]
[null,{"$f":"HLOOKUP(INDICE!$F$2,Nombres!$C$3:$E$857,34)","v":"1st Quarter"},{"$f":"HLOOKUP(INDICE!$F$2,Nombres!$C$3:$E$857,35)","v":"2nd Quarter"},{"$f":"HLOOKUP(INDICE!$F$2,Nombres!$C$3:$E$857,36)","v":"3rd Quarter"},{"$f":"HLOOKUP(INDICE!$F$2,Nombres!$C$3:$E$857,37)","v":"4th Quarter"},{"$f":"HLOOKUP(INDICE!$F$2,Nombres!$C$3:$E$857,34)","v":"1st Quarter"},{"$f":"HLOOKUP(INDICE!$F$2,Nombres!$C$3:$E$857,35)","v":"2nd Quarter"}]
[{"$f":"HLOOKUP(INDICE!$F$2,Nombres!$C$3:$E$853,38)","v":"Net interest income"},933.74738524000009,1126.8441222399999,1203.59736935,1434.3155633599999,801.96296129999996,850.37569377]
[{"$f":"HLOOKUP(INDICE!$F$2,Nombres!$C$3:$E$853,39)","v":"Net fees and commissions"},172.77039583999999,218.31401308,238.77107842999999,271.46344892000002,174.32400587999999,185.78697600999999]
[{"$f":"HLOOKUP(INDICE!$F$2,Nombres!$C$3:$E$853,40)","v":"Net trading income"},152.39999785999998,93.268660740000001,133.01718256999999,103.36827239000002,180.14843679000001,126.06113001999999]
[{"$f":"HLOOKUP(INDICE!$F$2,Nombres!$C$3:$E$853,95)","v":"Other income/expenses"},-98.896001639999994,-236.45299949000002,-221.02800195,-334.04099989000002,2.4960008900000048,-24.534002399999999]
[{"$f":"HLOOKUP(INDICE!$F$2,Nombres!$C$3:$E$853,44)","v":"Gross income"},1160.0217772999999,1201.9737965700001,1354.3576284000001,1475.1062847799999,1158.9314048599999,1137.6897974000001]
[{"$f":"HLOOKUP(INDICE!$F$2,Nombres!$C$3:$E$853,45)","v":"Operating expenses"},-495.37282524,-549.95700239000007,-587.78621129999999,-683.23753217000001,-503.80813788,-510.16875876999995]
[{"$f":"HLOOKUP(INDICE!$F$2,Nombres!$C$3:$E$853,46)","v":"  Administration expenses"},-461.40090081000005,-510.97448812000005,-544.57714419000001,-619.92882350000002,-476.95948017000001,-483.97529839999999]
[{"$f":"HLOOKUP(INDICE!$F$2,Nombres!$C$3:$E$853,47)","v":"  Personnel expenses"},-246.47326075000001,-269.97810591000001,-275.91583120000001,-306.57534799000001,-266.28986813,-260.46039689999998]
[{"$f":"HLOOKUP(INDICE!$F$2,Nombres!$C$3:$E$853,48)","v":"  General and administrative expenses"},-214.92764006000002,-240.99638220999998,-268.66131299,-313.35347551000001,-210.66961203999998,-223.51490150000001]
[{"$f":"HLOOKUP(INDICE!$F$2,Nombres!$C$3:$E$853,49)","v":"  Depreciation and amortization"},-33.971924430000001,-38.982514269999996,-43.209067109999999,-63.308708669999994,-26.848657709999998,-26.19346037]
[{"$f":"HLOOKUP(INDICE!$F$2,Nombres!$C$3:$E$853,50)","v":"Operating income"},664.64895206000006,652.01679418000003,766.57141709999996,791.86875261,655.12326698000004,627.52103863000002]
[{"$f":"HLOOKUP(INDICE!$F$2,Nombres!$C$3:$E$853,51)","v":"Impairment on financial assets (net)"},-136.50799974,-169.58800052999999,-199.12899853000002,-200.77900227999999,-136.68700078000001,-173.26199969999999]
[{"$f":"HLOOKUP(INDICE!$F$2,Nombres!$C$3:$E$853,160)","v":"Provisions (net) and other gains/losses"},-26.665999620000001,-27.724999830000002,-50.473999930000005,-113.65099844000001,-50.379999800000007,4.9369963400000003]
[{"$f":"HLOOKUP(INDICE!$F$2,Nombres!$C$3:$E$853,54)","v":"Income before tax"},501.47495270000002,454.70379381999999,516.96841863999998,477.43875189000005,468.05626639999997,459.19603527000004]
[{"$f":"HLOOKUP(INDICE!$F$2,Nombres!$C$3:$E$853,55)","v":"Income tax"},-141.6462114,-122.17464700000001,-111.95383763,-114.21240159,-144.65542031000001,-127.25423584000001]
[{"$f":"HLOOKUP(INDICE!$F$2,Nombres!$C$3:$E$853,56)","v":"Net income"},359.82874129999999,332.52914681999999,405.01458101000003,363.22635030000004,323.40084608999996,331.94179943]
[{"$f":"HLOOKUP(INDICE!$F$2,Nombres!$C$3:$E$853,57)","v":"Non-controlling interests"},-116.68885356999999,-94.868308450000001,-132.29980065000001,-115.8040809,-96.096411250000003,-84.861374560000002]
[{"$f":"HLOOKUP(INDICE!$F$2,Nombres!$C$3:$E$853,58)","v":"Net attributable profit"},243.13988773,237.66083837000002,272.71478035999996,247.4222694,227.30443484,247.08042487]
[{"$f":"HLOOKUP(INDICE!$F$2,Nombres!$C$3:$E$853,94)","v":"Balance sheet  "}]
[{"$f":"HLOOKUP(INDICE!$F$2,Nombres!$C$3:$E$853,30)","v":"(Million euros)"}]
[null,"2014-03-31","2014-06-30","2014-09-30","2014-12-31","2015-03-31","2015-06-30"]
[{"$f":"HLOOKUP(INDICE!$F$2,Nombres!$C$3:$E$853,100)","v":"Cash and balances with central banks"},11076.496999999999,10643.932000000001,10717.743,13522.715,9786.4290000000001,9722.4719999999998]
[{"$f":"HLOOKUP(INDICE!$F$2,Nombres!$C$3:$E$853,101)","v":"Financial assets"},9292.06,9185.8220000000001,9905.3829999999998,10670.65,10527.879000000001,9736.4969999999994]
[{"$f":"HLOOKUP(INDICE!$F$2,Nombres!$C$3:$E$853,102)","v":"Loans and receivables"},47225.194265120001,50785.556705199997,55067.159403370002,57212.26747929,50427.166326270002,49513.165076090001]
[{"$f":"HLOOKUP(INDICE!$F$2,Nombres!$C$3:$E$853,103)","v":"  . Loans and advances to customers"},42700.309265119999,46134.538705200001,49220.223403370001,51302.48347929,45799.780326270004,45018.343076090001]
[{"$f":"HLOOKUP(INDICE!$F$2,Nombres!$C$3:$E$853,104)","v":"  . Loans and advances to credit institutions and other"},4524.8850000000002,4651.018,5846.9359999999997,5909.7839999999997,4627.3860000000004,4494.8220000000001]
[{"$f":"HLOOKUP(INDICE!$F$2,Nombres!$C$3:$E$853,106)","v":"Tangible assets"},795.3,857.42399999999998,917.69600000000003,1062.4390000000001,808.26400000000001,767.375]
[{"$f":"HLOOKUP(INDICE!$F$2,Nombres!$C$3:$E$853,107)","v":"Other assets"},1578.9469999999999,1562.2728433600043,2012.0029999999999,1896.1379999999999,1979.2439999999999,1701.249]
[{"$f":"HLOOKUP(INDICE!$F$2,Nombres!$C$3:$E$853,108)","v":"Total assets / Liabilities and equity"},69967.998265120012,73035.00754856001,78619.984403370006,84364.209479289973,73528.982326269979,71440.758076090002]
[{"$f":"HLOOKUP(INDICE!$F$2,Nombres!$C$3:$E$853,109)","v":"Deposits from central banks and credit institutions"},4416.92,4360.607,5178.3130000000001,5770.1620000000003,7074.6170000000002,6407.348]
[{"$f":"HLOOKUP(INDICE!$F$2,Nombres!$C$3:$E$853,110)","v":"Deposits from customers"},48058.462,50342.773999999998,52096.069000000003,56369.898000000001,44055.207999999999,43337.52]
[{"$f":"HLOOKUP(INDICE!$F$2,Nombres!$C$3:$E$853,111)","v":"Debt certificates"},3783.181,4266.3980000000001,4656.8329999999996,4676.7370000000001,5314.7269999999999,5119.1760000000004]
[{"$f":"HLOOKUP(INDICE!$F$2,Nombres!$C$3:$E$853,112)","v":"Subordinated liabilities"},1243.00833878,1262.39333878,1540.7953384899999,1658.23633849,1813.877,2056.328]
[{"$f":"HLOOKUP(INDICE!$F$2,Nombres!$C$3:$E$853,114)","v":"Financial liabilities held for trading "},1358.4760000000001,1378.0509999999999,2405.1080000000002,2647.652,3659.2510000000002,3444.7620000000002]
[{"$f":"HLOOKUP(INDICE!$F$2,Nombres!$C$3:$E$853,115)","v":"Other liabilities"},8201.2431863400107,8345.7137797799987,9548.7783345300013,9833.6735398599667,8967.6311462699778,8481.9305860900022]
[{"$f":"HLOOKUP(INDICE!$F$2,Nombres!$C$3:$E$853,116)","v":"Economic capital allocated"},2906.7077399999998,3079.0704300000002,3194.0877303500001,3407.8506009399998,2643.6711799999998,2593.6934900000001]
[{"$f":"HLOOKUP(INDICE!$F$2,Nombres!$C$3:$E$853,117)","v":"Relevant business indicators"}]
[{"$f":"HLOOKUP(INDICE!$F$2,Nombres!$C$3:$E$853,201)","v":"Annex:"}]
[{"$f":"HLOOKUP(INDICE!$F$2,Nombres!$C$3:$E$853,30)","v":"(Million euros)"},"2014-03-31","2014-06-30","2014-09-30","2014-12-31","2015-03-31","2015-06-30"]
[{"$f":"HLOOKUP(INDICE!$F$2,Nombres!$C$3:$E$853,118)","v":"Loans and advances to customers gross"},44076.770265120002,47608.899705199998,50805.343403369996,52919.78447929,47212.302326270001,46403.033076089996]
[{"$f":"HLOOKUP(INDICE!$F$2,Nombres!$C$3:$E$853,121)","v":"Customer deposits under management (*)"},47944.216637589998,49961.66284094,52078.030258240004,56619.618704410001,44234.559995509997,43284.36277634]
[{"$f":"HLOOKUP(INDICE!$F$2,Nombres!$C$3:$E$853,122)","v":"Mutual funds"},3219.7823376699998,3170.8316486099998,3734.8865696600001,3847.55843465,4399.8091765899999,4327.66839213]
[{"$f":"HLOOKUP(INDICE!$F$2,Nombres!$C$3:$E$853,206)","v":"Pension funds"},3656.4477285299999,3828.2085989000002,4285.0318874900004,4631.6069399400003,5410.9752847899999,5381.2153253200004]
[{"$f":"HLOOKUP(INDICE!$F$2,Nombres!$C$3:$E$853,284)","v":"(*) Excluding repos and including specific marketable debt securities."}]
[{"$f":"HLOOKUP(INDICE!$F$2,Nombres!$C$3:$E$853,93)","v":"Income statement  "}]
[{"$f":"HLOOKUP(INDICE!$F$2,Nombres!$C$3:$E$853,31)","v":"(Constant million euros)    "}]
[null,2014,null,null,null,2015]
[null,{"$f":"HLOOKUP(INDICE!$F$2,Nombres!$C$3:$E$857,34)","v":"1st Quarter"},{"$f":"HLOOKUP(INDICE!$F$2,Nombres!$C$3:$E$857,35)","v":"2nd Quarter"},{"$f":"HLOOKUP(INDICE!$F$2,Nombres!$C$3:$E$857,36)","v":"3rd Quarter"},{"$f":"HLOOKUP(INDICE!$F$2,Nombres!$C$3:$E$857,37)","v":"4th Quarter"},{"$f":"HLOOKUP(INDICE!$F$2,Nombres!$C$3:$E$857,34)","v":"1st Quarter"},{"$f":"HLOOKUP(INDICE!$F$2,Nombres!$C$3:$E$857,35)","v":"2nd Quarter"}]
[{"$f":"HLOOKUP(INDICE!$F$2,Nombres!$C$3:$E$853,38)","v":"Net interest income"},699.81729691620001,749.71705244589998,759.16355936490004,839.5586422353,798.90245342809999,853.43620164189997]
[{"$f":"HLOOKUP(INDICE!$F$2,Nombres!$C$3:$E$853,39)","v":"Net fees and commissions"},148.42612675730001,168.6862346707,172.10549528129999,173.04638019399999,173.53186866039999,186.57911322960001]
[{"$f":"HLOOKUP(INDICE!$F$2,Nombres!$C$3:$E$853,40)","v":"Net trading income"},92.311072091400007,90.219721248599996,123.483061933,98.342333122100001,175.9257636696,130.28380314039998]
[{"$f":"HLOOKUP(INDICE!$F$2,Nombres!$C$3:$E$853,95)","v":"Other income/expenses"},11.403377908500001,9.0700720058999984,8.6966674216000008,-4.6942048209999996,3.9431129858,-25.9811144958]
[{"$f":"HLOOKUP(INDICE!$F$2,Nombres!$C$3:$E$853,44)","v":"Gross income"},951.95787367339994,1017.6930803712999,1063.4487840009001,1106.2531507305,1152.3031987439999,1144.3180035159999]
[{"$f":"HLOOKUP(INDICE!$F$2,Nombres!$C$3:$E$853,45)","v":"Operating expenses"},-433.17139039129995,-448.79085980800005,-462.19864841809999,-480.50665947009998,-502.27380298700001,-511.703093663]
[{"$f":"HLOOKUP(INDICE!$F$2,Nombres!$C$3:$E$853,46)","v":"  Administration expenses"},-408.6180693796,-424.85188234760005,-436.46656179219997,-457.66693939890001,-475.61782345899996,-485.31695511100003]
[{"$f":"HLOOKUP(INDICE!$F$2,Nombres!$C$3:$E$853,47)","v":"  Personnel expenses"},-225.93992407640002,-234.94360387739999,-234.2896941178,-241.47543618790002,-265.4918593562,-261.25840567390003]
[{"$f":"HLOOKUP(INDICE!$F$2,Nombres!$C$3:$E$853,48)","v":"  General and administrative expenses"},-182.6781453031,-189.9082784702,-202.1768676744,-216.19150321090001,-210.12596410289999,-224.05854943719999]
[{"$f":"HLOOKUP(INDICE!$F$2,Nombres!$C$3:$E$853,49)","v":"  Depreciation and amortization"},-24.553321011800001,-23.938977460499999,-25.732086626000001,-22.839720071200002,-26.655979528000003,-26.386138551999998]
[{"$f":"HLOOKUP(INDICE!$F$2,Nombres!$C$3:$E$853,50)","v":"Operating income"},518.78648328199995,568.90222056330003,601.25013558270007,625.74649126040003,650.02939575689993,632.61490985310002]
[{"$f":"HLOOKUP(INDICE!$F$2,Nombres!$C$3:$E$853,51)","v":"Impairment on financial assets (net)"},-124.00547744719999,-128.89519328770001,-138.5650464245,-122.6452556773,-136.75966755170001,-173.18933292829999]
[{"$f":"HLOOKUP(INDICE!$F$2,Nombres!$C$3:$E$853,160)","v":"Provisions (net) and other gains/losses"},-11.947235626099999,-10.9141255524,-28.230659751099999,-80.160259424000003,-48.601252609700005,3.1582491496999996]
[{"$f":"HLOOKUP(INDICE!$F$2,Nombres!$C$3:$E$853,54)","v":"Income before tax"},382.83377020860001,429.09290172319999,434.45442940700002,422.94097615910005,464.66847559539997,462.5838260745]
[{"$f":"HLOOKUP(INDICE!$F$2,Nombres!$C$3:$E$853,55)","v":"Income tax"},-101.2225886184,-105.61085418340001,-93.751204131099996,-113.3556588213,-143.18213558950001,-128.7275205606]
[{"$f":"HLOOKUP(INDICE!$F$2,Nombres!$C$3:$E$853,56)","v":"Net income"},281.61118159030002,323.48204753980002,340.70322527590002,309.58531733770002,321.48634000599998,333.8563055139]
[{"$f":"HLOOKUP(INDICE!$F$2,Nombres!$C$3:$E$853,57)","v":"Non-controlling interests"},-80.781669026299994,-90.206393649700004,-103.6335826664,-90.944427096799998,-95.275777083799994,-85.682008726299998]
[{"$f":"HLOOKUP(INDICE!$F$2,Nombres!$C$3:$E$853,58)","v":"Net attributable profit"},200.82951256389998,233.27565389009999,237.06964260949999,218.64089024089998,226.21056292240002,248.17429678759999]
[]
[{"$f":"HLOOKUP(INDICE!$F$2,Nombres!$C$3:$E$853,94)","v":"Balance sheet  "}]
[{"$f":"HLOOKUP(INDICE!$F$2,Nombres!$C$3:$E$853,31)","v":"(Constant million euros)    "}]
[null,"2014-03-31","2014-06-30","2014-09-30","2014-12-31","2015-03-31","2015-06-30"]
[{"$f":"HLOOKUP(INDICE!$F$2,Nombres!$C$3:$E$853,100)","v":"Cash and balances with central banks"},7148.1028962822002,6682.3132155083003,7308.4230944220999,8236.1515781331,9181.9614734196002,9722.4719999999998]
[{"$f":"HLOOKUP(INDICE!$F$2,Nombres!$C$3:$E$853,101)","v":"Financial assets"},7741.0026473887001,7523.7355526434003,8289.6940164610005,9184.9283813041002,10035.403460375301,9736.4969999999994]
[{"$f":"HLOOKUP(INDICE!$F$2,Nombres!$C$3:$E$853,102)","v":"Loans and receivables"},41087.505734532097,42592.769199773,44345.3973738965,45225.897800652398,47579.498511990801,49513.165076090001]
[{"$f":"HLOOKUP(INDICE!$F$2,Nombres!$C$3:$E$853,103)","v":"  . Loans and advances to customers"},37967.1180918916,39566.607069241203,40820.508665318201,42167.1156201099,43220.547095155103,45018.343076090001]
[{"$f":"HLOOKUP(INDICE!$F$2,Nombres!$C$3:$E$853,104)","v":"  . Loans and advances to credit institutions and other"},3120.3876426406,3026.1621305317999,3524.8887085782999,3058.7821805426001,4358.9514168357,4494.8220000000001]
[{"$f":"HLOOKUP(INDICE!$F$2,Nombres!$C$3:$E$853,106)","v":"Tangible assets"},628.47140571119996,643.46302590360006,668.39901209590005,724.47662009090004,759.89962673670004,767.375]
[{"$f":"HLOOKUP(INDICE!$F$2,Nombres!$C$3:$E$853,107)","v":"Other assets"},1454.1523891874001,1377.3289381507,1758.5853435488,1544.4104210897999,1870.3162828100001,1701.249]
[{"$f":"HLOOKUP(INDICE!$F$2,Nombres!$C$3:$E$853,108)","v":"Total assets / Liabilities and equity"},58059.235073101496,58819.609931978994,62370.49884042429,64915.864801270305,69427.079355332186,71440.758076090002]
[{"$f":"HLOOKUP(INDICE!$F$2,Nombres!$C$3:$E$853,109)","v":"Deposits from central banks and credit institutions"},4577.0774619147996,4469.1879109908996,5150.1060665079003,5535.1604675961999,6674.5488769235999,6407.348]
[{"$f":"HLOOKUP(INDICE!$F$2,Nombres!$C$3:$E$853,110)","v":"Deposits from customers"},37375.623835481398,37782.240014602401,38060.010406031499,39809.641148727598,41515.703918004103,43337.52]
[{"$f":"HLOOKUP(INDICE!$F$2,Nombres!$C$3:$E$853,111)","v":"Debt certificates"},4042.6121357840998,4497.7988006567002,4841.4225184452998,4804.50953785,5018.5374163747001,5119.1760000000004]
[{"$f":"HLOOKUP(INDICE!$F$2,Nombres!$C$3:$E$853,112)","v":"Subordinated liabilities"},1290.8880873296,1284.0989067367,1552.9313324304001,1683.6577608693999,1714.2435648639,2056.328]
[{"$f":"HLOOKUP(INDICE!$F$2,Nombres!$C$3:$E$853,114)","v":"Financial liabilities held for trading "},1439.4179617642999,1438.7909111097999,2458.8874051489001,2721.0709897597999,3481.6471698475998,3444.7620000000002]
[{"$f":"HLOOKUP(INDICE!$F$2,Nombres!$C$3:$E$853,115)","v":"Other liabilities"},7056.4705845508934,7031.2944480723936,8004.6002236020913,7933.0981128264075,8526.7098268753834,8481.9305860900022]
[{"$f":"HLOOKUP(INDICE!$F$2,Nombres!$C$3:$E$853,116)","v":"Economic capital allocated"},2277.1450062765002,2316.1989398101,2302.5408882583001,2428.7267836409001,2495.6885824429,2593.6934900000001]
[{"$f":"HLOOKUP(INDICE!$F$2,Nombres!$C$3:$E$853,117)","v":"Relevant business indicators"}]
[{"$f":"HLOOKUP(INDICE!$F$2,Nombres!$C$3:$E$853,201)","v":"Annex:"}]
[{"$f":"HLOOKUP(INDICE!$F$2,Nombres!$C$3:$E$853,31)","v":"(Constant million euros)    "}]
[null,"2014-03-31","2014-06-30","2014-09-30","2014-12-31","2015-03-31","2015-06-30"]
[{"$f":"HLOOKUP(INDICE!$F$2,Nombres!$C$3:$E$853,118)","v":"Loans and advances to customers gross"},39185.320470635103,40812.371729084502,42110.217381800598,43453.353111527402,44552.818676233801,46403.033076089996]
[{"$f":"HLOOKUP(INDICE!$F$2,Nombres!$C$3:$E$853,121)","v":"Customer deposits under management (*)"},37364.4892713113,37504.190372817699,38173.614499333802,40077.1799562507,41693.0941247804,43284.36277634]
[{"$f":"HLOOKUP(INDICE!$F$2,Nombres!$C$3:$E$853,122)","v":"Mutual funds"},3367.8181833639001,3260.6740245082001,3775.0516312184,3926.5455874012,4155.3089070698998,4327.66839213]
[{"$f":"HLOOKUP(INDICE!$F$2,Nombres!$C$3:$E$853,206)","v":"Pension funds"},4505.7717085752001,4672.9522261002003,4818.8585378447997,5025.6498431593,5202.9985529551996,5381.2153253200004]
[{"$f":"HLOOKUP(INDICE!$F$2,Nombres!$C$3:$E$853,284)","v":"(*) Excluding repos and including specific marketable debt securities."}]

{"sheet":"Argentina","index":10,"n_rows":99,"n_cols":7,"rows_kept":99,"cut":false,"hidden":false,"merged":[[3,1,3,4],[3,5,3,6],[51,1,51,4],[51,5,51,6]]}
[{"$f":"HLOOKUP(INDICE!$F$2,Nombres!$C$3:$E$853,15)","v":"Argentina"}]
[{"$f":"HLOOKUP(INDICE!$F$2,Nombres!$C$3:$E$853,93)","v":"Income statement  "}]
[{"$f":"HLOOKUP(INDICE!$F$2,Nombres!$C$3:$E$853,30)","v":"(Million euros)"}]
[null,2014,null,null,null,2015]
[null,{"$f":"HLOOKUP(INDICE!$F$2,Nombres!$C$3:$E$857,34)","v":"1st Quarter"},{"$f":"HLOOKUP(INDICE!$F$2,Nombres!$C$3:$E$857,35)","v":"2nd Quarter"},{"$f":"HLOOKUP(INDICE!$F$2,Nombres!$C$3:$E$857,36)","v":"3rd Quarter"},{"$f":"HLOOKUP(INDICE!$F$2,Nombres!$C$3:$E$857,37)","v":"4th Quarter"},{"$f":"HLOOKUP(INDICE!$F$2,Nombres!$C$3:$E$857,34)","v":"1st Quarter"},{"$f":"HLOOKUP(INDICE!$F$2,Nombres!$C$3:$E$857,35)","v":"2nd Quarter"}]
[{"$f":"HLOOKUP(INDICE!$F$2,Nombres!$C$3:$E$853,38)","v":"Net interest income"},125.44400015000001,137.81756781999999,160.00803138000001,183.97694009000003,202.79400002,212.67900044000004]
[{"$f":"HLOOKUP(INDICE!$F$2,Nombres!$C$3:$E$853,39)","v":"Net fees and commissions"},43.566999420000002,47.408477509999997,49.11245555,43.623467329999997,59.147998489999992,62.210002549999999]
[{"$f":"HLOOKUP(INDICE!$F$2,Nombres!$C$3:$E$853,40)","v":"Net trading income"},22.36300065,30.643998799999999,35.500001239999996,35.614999519999998,26.496000559999999,20.154998619999997]
[{"$f":"HLOOKUP(INDICE!$F$2,Nombres!$C$3:$E$853,95)","v":"Other income/expenses"},17.174999,19.938001440000001,23.617999739999998,21.069999359999997,20.01699962,20.262002330000001]
[{"$f":"HLOOKUP(INDICE!$F$2,Nombres!$C$3:$E$853,44)","v":"Gross income"},208.54899921999998,235.80804556999999,268.23848791,284.28540629999998,308.45499869000002,315.30600393999998]
[{"$f":"HLOOKUP(INDICE!$F$2,Nombres!$C$3:$E$853,45)","v":"Operating expenses"},-109.90145151999999,-117.72843919,-116.03044022,-129.87244572,-159.75652811999998,-161.46652796000001]
[{"$f":"HLOOKUP(INDICE!$F$2,Nombres!$C$3:$E$853,46)","v":"  Administration expenses"},-106.09545211,-114.00543992999999,-111.91343963999999,-125.03144452000001,-154.20552809,-154.62952937]
[{"$f":"HLOOKUP(INDICE!$F$2,Nombres!$C$3:$E$853,47)","v":"  Personnel expenses"},-57.540000259999999,-64.295000689999995,-57.866997689999998,-68.282001070000007,-89.47300036,-84.586000330000005]
[{"$f":"HLOOKUP(INDICE!$F$2,Nombres!$C$3:$E$853,48)","v":"  General and administrative expenses"},-48.555451849999997,-49.710439239999999,-54.046441950000002,-56.749443450000001,-64.732527730000001,-70.043529039999996]
[{"$f":"HLOOKUP(INDICE!$F$2,Nombres!$C$3:$E$853,49)","v":"  Depreciation and amortization"},-3.8059994100000001,-3.7229992599999999,-4.11700058,-4.8410012,-5.55100003,-6.8369985900000003]
[{"$f":"HLOOKUP(INDICE!$F$2,Nombres!$C$3:$E$853,50)","v":"Operating income"},98.64754769999999,118.07960638,152.20804769,154.41296058,148.69847056999998,153.83947598]
[{"$f":"HLOOKUP(INDICE!$F$2,Nombres!$C$3:$E$853,51)","v":"Impairment on financial assets (net)"},-10.187999829999999,-14.063000109999999,-15.703000289999999,-12.84400014,-15.01099979,-21.683000249999999]
[{"$f":"HLOOKUP(INDICE!$F$2,Nombres!$C$3:$E$853,160)","v":"Provisions (net) and other gains/losses"},-7.026999420000001,-7.3089997400000009,-28.867000990000001,-8.9359997799999995,-14.554001299999999,-8.6759996800000003]
[{"$f":"HLOOKUP(INDICE!$F$2,Nombres!$C$3:$E$853,54)","v":"Income before tax"},81.432548449999999,96.707606530000007,107.63804641,132.63296066000001,119.13346948,123.48047604999999]
[{"$f":"HLOOKUP(INDICE!$F$2,Nombres!$C$3:$E$853,55)","v":"Income tax"},-25.47254186,-31.119912299999999,-35.419491610000001,-44.275344359999998,-40.925165810000003,-41.028465619999999]
[{"$f":"HLOOKUP(INDICE!$F$2,Nombres!$C$3:$E$853,56)","v":"Net income"},55.960006589999992,65.587694229999997,72.218554800000007,88.357616300000004,78.208303669999992,82.452010430000001]
[{"$f":"HLOOKUP(INDICE!$F$2,Nombres!$C$3:$E$853,57)","v":"Non-controlling interests"},-13.06063529,-15.07024974,-17.166348670000001,-20.1620043,-17.969984,-19.011412010000001]
[{"$f":"HLOOKUP(INDICE!$F$2,Nombres!$C$3:$E$853,58)","v":"Net attributable profit"},42.899371299999999,50.517444490000003,55.052206130000002,68.195611999999997,60.238319670000003,63.440598420000001]
[{"$f":"HLOOKUP(INDICE!$F$2,Nombres!$C$3:$E$853,94)","v":"Balance sheet  "}]
[{"$f":"HLOOKUP(INDICE!$F$2,Nombres!$C$3:$E$853,30)","v":"(Million euros)"}]
[null,"2014-03-31","2014-06-30","2014-09-30","2014-12-31","2015-03-31","2015-06-30"]
[{"$f":"HLOOKUP(INDICE!$F$2,Nombres!$C$3:$E$853,100)","v":"Cash and balances with central banks"},1148.788,1210.155,1328.9680000000001,1266.1130000000001,1376.0239999999999,1266.1610000000001]
[{"$f":"HLOOKUP(INDICE!$F$2,Nombres!$C$3:$E$853,101)","v":"Financial assets"},547.11699999999996,712.94299999999998,681.47500000000002,1022.58,1325.0840000000001,1385.9190000000001]
[{"$f":"HLOOKUP(INDICE!$F$2,Nombres!$C$3:$E$853,102)","v":"Loans and receivables"},3581.1280000000002,3673.4850000000001,4145.8469999999998,4345.2370000000001,5125.7910000000002,5214.848]
[{"$f":"HLOOKUP(INDICE!$F$2,Nombres!$C$3:$E$853,103)","v":"  . Loans and advances to customers"},3140.5770000000002,3268.701,3691.232,3905.8820000000001,4474.2259999999997,4584.3559999999998]
[{"$f":"HLOOKUP(INDICE!$F$2,Nombres!$C$3:$E$853,104)","v":"  . Loans and advances to credit institutions and other"},440.55099999999999,404.78399999999999,454.61500000000001,439.35500000000002,651.56500000000005,630.49199999999996]
[{"$f":"HLOOKUP(INDICE!$F$2,Nombres!$C$3:$E$853,106)","v":"Tangible assets"},134.72900000000001,148.25399999999999,173.66399999999999,201.26400000000001,231.904,231.45500000000001]
[{"$f":"HLOOKUP(INDICE!$F$2,Nombres!$C$3:$E$853,107)","v":"Other assets"},162.47200000000001,170.084,177.751,184.27363459999879,185.89599999999999,201.86099999999999]
[{"$f":"HLOOKUP(INDICE!$F$2,Nombres!$C$3:$E$853,108)","v":"Total assets / Liabilities and equity"},5574.2340000000004,5914.9209999999994,6507.7049999999999,7019.4676345999997,8244.6990000000005,8300.2440000000006]
[{"$f":"HLOOKUP(INDICE!$F$2,Nombres!$C$3:$E$853,109)","v":"Deposits from central banks and credit institutions"},28.983000000000001,54.372,61.680999999999997,58.29,66.111000000000004,183.21100000000001]
[{"$f":"HLOOKUP(INDICE!$F$2,Nombres!$C$3:$E$853,110)","v":"Deposits from customers"},4060.9560000000001,4318.116,4660.49,4945.3029999999999,5829.348,5895.0290000000005]
[{"$f":"HLOOKUP(INDICE!$F$2,Nombres!$C$3:$E$853,111)","v":"Debt certificates"},95.031000000000006,93.534999999999997,137.26400000000001,163.05500000000001,179.74600000000001,157.94999999999999]
[{"$f":"HLOOKUP(INDICE!$F$2,Nombres!$C$3:$E$853,112)","v":"Subordinated liabilities"},"0","0","0","0","0","0"]
[{"$f":"HLOOKUP(INDICE!$F$2,Nombres!$C$3:$E$853,114)","v":"Financial liabilities held for trading "},5.5730000000000004,1.365,0.36199999999999999,0.125,-0.86799999999999999,5.6609999999999996]
[{"$f":"HLOOKUP(INDICE!$F$2,Nombres!$C$3:$E$853,115)","v":"Other liabilities"},1073.3778999999997,1144.3025999999998,1338.6368447299988,1530.2815008399998,1732.0073200000008,1604.6202000000003]
[{"$f":"HLOOKUP(INDICE!$F$2,Nombres!$C$3:$E$853,116)","v":"Economic capital allocated"},310.31310000000002,303.23039999999997,309.27115527000001,322.41313375999999,438.35467999999997,453.77280000000002]
[{"$f":"HLOOKUP(INDICE!$F$2,Nombres!$C$3:$E$853,117)","v":"Relevant business indicators"}]
[{"$f":"HLOOKUP(INDICE!$F$2,Nombres!$C$3:$E$853,201)","v":"Annex:"}]
[{"$f":"HLOOKUP(INDICE!$F$2,Nombres!$C$3:$E$853,30)","v":"(Million euros)"},"2014-03-31","2014-06-30","2014-09-30","2014-12-31","2015-03-31","2015-06-30"]
[{"$f":"HLOOKUP(INDICE!$F$2,Nombres!$C$3:$E$853,118)","v":"Loans and advances to customers gross"},3247.8549999999996,3383.9589999999998,3819.933,4045.5509999999999,4629.0869999999995,4740.8099999999995]
[{"$f":"HLOOKUP(INDICE!$F$2,Nombres!$C$3:$E$853,121)","v":"Customer deposits under management (*)"},3987.8126320699998,4225.3175226800004,4541.4825324200001,4868.6022575999996,5729.4201930199997,5793.8344331799999]
[{"$f":"HLOOKUP(INDICE!$F$2,Nombres!$C$3:$E$853,122)","v":"Mutual funds"},281.19901972000002,317.34047855,506.88692964000001,647.23638722999999,819.06714019000003,941.97837758000003]
[{"$f":"HLOOKUP(INDICE!$F$2,Nombres!$C$3:$E$853,206)","v":"Pension funds"},"0","0","0","0","0","0"]
[{"$f":"HLOOKUP(INDICE!$F$2,Nombres!$C$3:$E$853,284)","v":"(*) Excluding repos and including specific marketable debt securities."}]
[{"$f":"HLOOKUP(INDICE!$F$2,Nombres!$C$3:$E$853,93)","v":"Income statement  "}]
[{"$f":"HLOOKUP(INDICE!$F$2,Nombres!$C$3:$E$853,31)","v":"(Constant million euros)    "}]
[null,2014,null,null,null,2015]
[null,{"$f":"HLOOKUP(INDICE!$F$2,Nombres!$C$3:$E$857,34)","v":"1st Quarter"},{"$f":"HLOOKUP(INDICE!$F$2,Nombres!$C$3:$E$857,35)","v":"2nd Quarter"},{"$f":"HLOOKUP(INDICE!$F$2,Nombres!$C$3:$E$857,36)","v":"3rd Quarter"},{"$f":"HLOOKUP(INDICE!$F$2,Nombres!$C$3:$E$857,37)","v":"4th Quarter"},{"$f":"HLOOKUP(INDICE!$F$2,Nombres!$C$3:$E$857,34)","v":"1st Quarter"},{"$f":"HLOOKUP(INDICE!$F$2,Nombres!$C$3:$E$857,35)","v":"2nd Quarter"}]
[{"$f":"HLOOKUP(INDICE!$F$2,Nombres!$C$3:$E$853,38)","v":"Net interest income"},132.65583970940003,154.3612833448,178.35838023509999,199.51067784809999,201.66748788800004,213.805512572]
[{"$f":"HLOOKUP(INDICE!$F$2,Nombres!$C$3:$E$853,39)","v":"Net fees and commissions"},46.071688440700001,53.1130116211,54.838863602399996,47.125661761900005,58.819433848599999,62.538567191400006]
[{"$f":"HLOOKUP(INDICE!$F$2,Nombres!$C$3:$E$853,40)","v":"Net trading income"},23.648660965000001,34.141454778700002,39.521361513199999,38.592142368200001,26.3488163924,20.3021827876]
[{"$f":"HLOOKUP(INDICE!$F$2,Nombres!$C$3:$E$853,95)","v":"Other income/expenses"},18.162398453800002,22.299514374399998,26.310470110400001,22.793140559600001,19.905806029899999,20.373195920200001]
[{"$f":"HLOOKUP(INDICE!$F$2,Nombres!$C$3:$E$853,44)","v":"Gross income"},220.53858756890003,263.91526411899997,299.02907546120002,308.0216225378,306.74154415890001,317.01945847109999]
[{"$f":"HLOOKUP(INDICE!$F$2,Nombres!$C$3:$E$853,45)","v":"Operating expenses"},-116.21974203009999,-131.95045940310001,-129.67668318299999,-140.63346736840001,-158.8690873324,-162.35396874759999]
[{"$f":"HLOOKUP(INDICE!$F$2,Nombres!$C$3:$E$853,46)","v":"  Administration expenses"},-112.1949337726,-127.7668855773,-125.08054830929999,-135.38604321809999,-153.34892287389999,-155.48613458610001]
[{"$f":"HLOOKUP(INDICE!$F$2,Nombres!$C$3:$E$853,47)","v":"  Personnel expenses"},-60.848004226899995,-71.980846294700001,-64.749497149999996,-73.944211686900005,-88.975981610100007,-85.08301908]
[{"$f":"HLOOKUP(INDICE!$F$2,Nombres!$C$3:$E$853,48)","v":"  General and administrative expenses"},-51.346929545600005,-55.786039282600001,-60.331051159200001,-61.441831531200002,-64.372941263800001,-70.403115506199995]
[{"$f":"HLOOKUP(INDICE!$F$2,Nombres!$C$3:$E$853,49)","v":"  Depreciation and amortization"},-4.0248082575000002,-4.1835738257999999,-4.5961348737000005,-5.2474241503000005,-5.5201644586,-6.8678341613999994]
[{"$f":"HLOOKUP(INDICE!$F$2,Nombres!$C$3:$E$853,50)","v":"Operating income"},104.3188455387,131.96480471620001,169.35239227810001,167.38815516950001,147.87245682650001,154.6654897235]
[{"$f":"HLOOKUP(INDICE!$F$2,Nombres!$C$3:$E$853,51)","v":"Impairment on financial assets (net)"},-10.7737131373,-15.665589369499999,-17.489231444200001,-13.881035239999999,-14.9276143182,-21.766385721900001]
[{"$f":"HLOOKUP(INDICE!$F$2,Nombres!$C$3:$E$853,160)","v":"Provisions (net) and other gains/losses"},-7.4309852012000004,-8.198630875100001,-31.871120970000003,-9.5872795996000004,-14.4731544355,-8.7568465445000001]
[{"$f":"HLOOKUP(INDICE!$F$2,Nombres!$C$3:$E$853,54)","v":"Income before tax"},86.114147200299996,108.1005844715,119.99203986399999,143.9198403298,118.47168807279999,124.1422574572]
[{"$f":"HLOOKUP(INDICE!$F$2,Nombres!$C$3:$E$853,55)","v":"Income tax"},-26.936971285399999,-34.762134682899998,-39.4659803905,-48.058548502299999,-40.697828236999996,-41.255803192999998]
[{"$f":"HLOOKUP(INDICE!$F$2,Nombres!$C$3:$E$853,56)","v":"Net income"},59.177175914900005,73.338449788600002,80.526059473399997,95.861291827499997,77.773859835899998,82.88645426410001]
[{"$f":"HLOOKUP(INDICE!$F$2,Nombres!$C$3:$E$853,57)","v":"Non-controlling interests"},-13.811497875200001,-16.8577933264,-19.134009019099999,-21.869307109600001,-17.870161495399998,-19.111234514499998]
[{"$f":"HLOOKUP(INDICE!$F$2,Nombres!$C$3:$E$853,58)","v":"Net attributable profit"},45.365678039599999,56.480656462200002,61.392050454300005,73.991984717999998,59.903698340399998,63.775219749599998]
[]
[{"$f":"HLOOKUP(INDICE!$F$2,Nombres!$C$3:$E$853,94)","v":"Balance sheet  "}]
[{"$f":"HLOOKUP(INDICE!$F$2,Nombres!$C$3:$E$853,31)","v":"(Constant million euros)    "}]
[null,"2014-03-31","2014-06-30","2014-09-30","2014-12-31","2015-03-31","2015-06-30"]
[{"$f":"HLOOKUP(INDICE!$F$2,Nombres!$C$3:$E$853,100)","v":"Cash and balances with central banks"},1247.7493078893001,1322.694737605,1392.2057070226001,1293.6934952081999,1284.3769462113,1266.1610000000001]
[{"$f":"HLOOKUP(INDICE!$F$2,Nombres!$C$3:$E$853,101)","v":"Financial assets"},594.24790133989995,779.24394338929994,713.90235445339999,1044.8554705070001,1236.8296929365999,1385.9190000000001]
[{"$f":"HLOOKUP(INDICE!$F$2,Nombres!$C$3:$E$853,102)","v":"Loans and receivables"},3889.6210471060999,4015.1049065374,4343.1232759876002,4439.8918911962,4784.3989577923003,5214.848]
[{"$f":"HLOOKUP(INDICE!$F$2,Nombres!$C$3:$E$853,103)","v":"  . Loans and advances to customers"},3411.1191778839998,3572.6775590764,3866.8758437709998,3990.9661589850002,4176.2300123682999,4584.3559999999998]
[{"$f":"HLOOKUP(INDICE!$F$2,Nombres!$C$3:$E$853,104)","v":"  . Loans and advances to credit institutions and other"},478.50186922209997,442.4273474611,476.24743221669996,448.92573221129999,608.16894542399996,630.49199999999996]
[{"$f":"HLOOKUP(INDICE!$F$2,Nombres!$C$3:$E$853,106)","v":"Tangible assets"},146.33510839479999,162.04104898040001,181.9276400217,205.6482538443,216.45854384379999,231.45500000000001]
[{"$f":"HLOOKUP(INDICE!$F$2,Nombres!$C$3:$E$853,107)","v":"Other assets"},176.4680041499,185.90115460480001,186.20911611790001,188.28777717350255,173.5148055505,201.86099999999999]
[{"$f":"HLOOKUP(INDICE!$F$2,Nombres!$C$3:$E$853,108)","v":"Total assets / Liabilities and equity"},6054.4213688799991,6464.9857911169001,6817.3680936031014,7172.3768879292011,7695.5789463344991,8300.2440000000006]
[{"$f":"HLOOKUP(INDICE!$F$2,Nombres!$C$3:$E$853,109)","v":"Deposits from central banks and credit institutions"},31.4797144387,59.428385845699999,64.616033053400002,59.559765862699997,61.707822168100002,183.21100000000001]
[{"$f":"HLOOKUP(INDICE!$F$2,Nombres!$C$3:$E$853,110)","v":"Deposits from customers"},4410.7833981281001,4719.6840979607996,4882.2550847890998,5053.0294870471998,5441.0970903433999,5895.0290000000005]
[{"$f":"HLOOKUP(INDICE!$F$2,Nombres!$C$3:$E$853,111)","v":"Debt certificates"},103.2173599289,102.2333934759,143.795579855,166.6069243908,167.77441278180001,157.94999999999999]
[{"$f":"HLOOKUP(INDICE!$F$2,Nombres!$C$3:$E$853,112)","v":"Subordinated liabilities"},"0","0","0","0","0","0"]
[{"$f":"HLOOKUP(INDICE!$F$2,Nombres!$C$3:$E$853,114)","v":"Financial liabilities held for trading "},6.0530810670999999,1.4919397240999999,0.37922543349999999,0.1277229496,-0.81018876799999995,5.6609999999999996]
[{"$f":"HLOOKUP(INDICE!$F$2,Nombres!$C$3:$E$853,115)","v":"Other liabilities"},1165.8430727240991,1250.7183189325006,1402.334634741801,1563.6165361814001,1616.6507796935,1604.6202000000003]
[{"$f":"HLOOKUP(INDICE!$F$2,Nombres!$C$3:$E$853,116)","v":"Economic capital allocated"},337.04474259300002,331.42965517789997,323.98753573030001,329.43645149759999,409.15903011559999,453.77280000000002]
[{"$f":"HLOOKUP(INDICE!$F$2,Nombres!$C$3:$E$853,117)","v":"Relevant business indicators"}]
[{"$f":"HLOOKUP(INDICE!$F$2,Nombres!$C$3:$E$853,201)","v":"Annex:"}]
[{"$f":"HLOOKUP(INDICE!$F$2,Nombres!$C$3:$E$853,31)","v":"(Constant million euros)    "}]
[null,"2014-03-31","2014-06-30","2014-09-30","2014-12-31","2015-03-31","2015-06-30"]
[{"$f":"HLOOKUP(INDICE!$F$2,Nombres!$C$3:$E$853,118)","v":"Loans and advances to customers gross"},3527.6385446006002,3698.6541075903001,4001.7009612301999,4133.6776521788997,4320.7768358737003,4740.8099999999995]
[{"$f":"HLOOKUP(INDICE!$F$2,Nombres!$C$3:$E$853,121)","v":"Customer deposits under management (*)"},4331.3391606262003,4618.2557209274,4757.5847574801001,4974.6579265935998,5347.8247552892999,5793.8344331799999]
[{"$f":"HLOOKUP(INDICE!$F$2,Nombres!$C$3:$E$853,122)","v":"Mutual funds"},305.42265608169998,346.85191649590001,531.00667304249998,661.3355237815,764.5149737644,941.97837758000003]
[{"$f":"HLOOKUP(INDICE!$F$2,Nombres!$C$3:$E$853,206)","v":"Pension funds"},"0","0","0","0","0","0"]
[{"$f":"HLOOKUP(INDICE!$F$2,Nombres!$C$3:$E$853,284)","v":"(*) Excluding repos and including specific marketable debt securities."}]

{"sheet":"Chile","index":11,"n_rows":99,"n_cols":7,"rows_kept":99,"cut":false,"hidden":false,"merged":[[3,1,3,4],[3,5,3,6],[51,1,51,4],[51,5,51,6]]}
[{"$f":"HLOOKUP(INDICE!$F$2,Nombres!$C$3:$E$853,16)","v":"Chile"}]
[{"$f":"HLOOKUP(INDICE!$F$2,Nombres!$C$3:$E$853,93)","v":"Income statement  "}]
[{"$f":"HLOOKUP(INDICE!$F$2,Nombres!$C$3:$E$853,30)","v":"(Million euros)"}]
[null,2014,null,null,null,2015]
[null,{"$f":"HLOOKUP(INDICE!$F$2,Nombres!$C$3:$E$857,34)","v":"1st Quarter"},{"$f":"HLOOKUP(INDICE!$F$2,Nombres!$C$3:$E$857,35)","v":"2nd Quarter"},{"$f":"HLOOKUP(INDICE!$F$2,Nombres!$C$3:$E$857,36)","v":"3rd Quarter"},{"$f":"HLOOKUP(INDICE!$F$2,Nombres!$C$3:$E$857,37)","v":"4th Quarter"},{"$f":"HLOOKUP(INDICE!$F$2,Nombres!$C$3:$E$857,34)","v":"1st Quarter"},{"$f":"HLOOKUP(INDICE!$F$2,Nombres!$C$3:$E$857,35)","v":"2nd Quarter"}]
[{"$f":"HLOOKUP(INDICE!$F$2,Nombres!$C$3:$E$853,38)","v":"Net interest income"},124.06399994,131.76700037000001,114.75999903,141.61800073000001,119.18100007999999,141.74200045000001]
[{"$f":"HLOOKUP(INDICE!$F$2,Nombres!$C$3:$E$853,39)","v":"Net fees and commissions"},15.048373219999998,18.369730490000002,20.617183579999999,22.029630579999999,22.198777,20.584996240000002]
[{"$f":"HLOOKUP(INDICE!$F$2,Nombres!$C$3:$E$853,40)","v":"Net trading income"},15.96943126,8.2456565899999994,28.252607730000001,-7.2932761599999996,27.860549370000001,19.47585364]
[{"$f":"HLOOKUP(INDICE!$F$2,Nombres!$C$3:$E$853,95)","v":"Other income/expenses"},3.0110004200000002,4.1159995200000008,0.2560001300000001,-1.4399999800000001,2.6950007899999999,4.0039974599999999]
[{"$f":"HLOOKUP(INDICE!$F$2,Nombres!$C$3:$E$853,44)","v":"Gross income"},158.09280483999999,162.49838697000001,163.88579046999999,154.91435516999999,171.93532723999999,185.80684779000001]
[{"$f":"HLOOKUP(INDICE!$F$2,Nombres!$C$3:$E$853,45)","v":"Operating expenses"},-73.118642940000001,-74.640445270000001,-75.601038549999998,-78.942075349999996,-83.320375939999991,-88.520386059999993]
[{"$f":"HLOOKUP(INDICE!$F$2,Nombres!$C$3:$E$853,46)","v":"  Administration expenses"},-69.960642849999999,-72.690444569999997,-72.746038869999992,-76.650075820000012,-80.755375659999999,-85.87738576000001]
[{"$f":"HLOOKUP(INDICE!$F$2,Nombres!$C$3:$E$853,47)","v":"  Personnel expenses"},-40.055999749999998,-39.651000410000002,-40.551001159999998,-42.286001460000001,-43.754998919999998,-45.258001229999998]
[{"$f":"HLOOKUP(INDICE!$F$2,Nombres!$C$3:$E$853,48)","v":"  General and administrative expenses"},-29.904643100000001,-33.039444160000002,-32.195037710000001,-34.364074360000004,-37.000376739999993,-40.619384529999998]
[{"$f":"HLOOKUP(INDICE!$F$2,Nombres!$C$3:$E$853,49)","v":"  Depreciation and amortization"},-3.1580000899999998,-1.9500006999999999,-2.8549996800000002,-2.29199953,-2.5650002800000005,-2.6430003000000002]
[{"$f":"HLOOKUP(INDICE!$F$2,Nombres!$C$3:$E$853,50)","v":"Operating income"},84.974161899999999,87.857941699999998,88.284751920000005,75.972279819999997,88.614951300000001,97.286461729999999]
[{"$f":"HLOOKUP(INDICE!$F$2,Nombres!$C$3:$E$853,51)","v":"Impairment on financial assets (net)"},-28.834000799999998,-26.24699931,-30.555999149999998,-19.391000290000001,-36.766000480000002,-34.967999450000001]
[{"$f":"HLOOKUP(INDICE!$F$2,Nombres!$C$3:$E$853,160)","v":"Provisions (net) and other gains/losses"},0.52500020000000003,0.43300033000000004,-2.2700015100000002,-54.512998780000004,-1.0939992000000001,4.8369990899999999]
[{"$f":"HLOOKUP(INDICE!$F$2,Nombres!$C$3:$E$853,54)","v":"Income before tax"},56.665161300000001,62.043942720000004,55.45875126,2.0682807499999996,50.75495162,67.155461369999998]
[{"$f":"HLOOKUP(INDICE!$F$2,Nombres!$C$3:$E$853,55)","v":"Income tax"},-6.8326319199999999,-4.3109167299999998,15.411582459999998,9.9686229200000014,-9.0717364099999998,-9.1506675000000008]
[{"$f":"HLOOKUP(INDICE!$F$2,Nombres!$C$3:$E$853,56)","v":"Net income"},49.832529379999997,57.733025990000002,70.870333720000005,12.036903670000001,41.68321521,58.00479387]
[{"$f":"HLOOKUP(INDICE!$F$2,Nombres!$C$3:$E$853,57)","v":"Non-controlling interests"},-14.26998279,-15.65666933,-21.527240880000001,-3.0933085700000014,-11.47694589,-13.95385143]
[{"$f":"HLOOKUP(INDICE!$F$2,Nombres!$C$3:$E$853,58)","v":"Net attributable profit"},35.562546589999997,42.076356660000002,49.343092839999997,8.9435950999999978,30.206269319999997,44.05094244]
[{"$f":"HLOOKUP(INDICE!$F$2,Nombres!$C$3:$E$853,94)","v":"Balance sheet  "}]
[{"$f":"HLOOKUP(INDICE!$F$2,Nombres!$C$3:$E$853,30)","v":"(Million euros)"}]
[null,"2014-03-31","2014-06-30","2014-09-30","2014-12-31","2015-03-31","2015-06-30"]
[{"$f":"HLOOKUP(INDICE!$F$2,Nombres!$C$3:$E$853,100)","v":"Cash and balances with central banks"},381.95699999999999,362.41,370.53100000000001,589.33100000000002,396.94499999999999,592.29499999999996]
[{"$f":"HLOOKUP(INDICE!$F$2,Nombres!$C$3:$E$853,101)","v":"Financial assets"},1595.252,1886.4079999999999,2227.806,2631.029,2899.8429999999998,2676.4870000000001]
[{"$f":"HLOOKUP(INDICE!$F$2,Nombres!$C$3:$E$853,102)","v":"Loans and receivables"},12570.792265120001,13104.458705200001,13419.03340337,13613.16347929,15338.231326270001,14360.630076089999]
[{"$f":"HLOOKUP(INDICE!$F$2,Nombres!$C$3:$E$853,103)","v":"  . Loans and advances to customers"},11042.596265120001,11467.888705199999,11548.54040337,12125.55447929,13396.61332627,12658.02807609]
[{"$f":"HLOOKUP(INDICE!$F$2,Nombres!$C$3:$E$853,104)","v":"  . Loans and advances to credit institutions and other"},1528.1959999999999,1636.57,1870.4929999999999,1487.6089999999999,1941.6179999999999,1702.6020000000001]
[{"$f":"HLOOKUP(INDICE!$F$2,Nombres!$C$3:$E$853,106)","v":"Tangible assets"},82.302000000000007,82.900999999999996,84.471999999999994,89.14,121.586,108.235]
[{"$f":"HLOOKUP(INDICE!$F$2,Nombres!$C$3:$E$853,107)","v":"Other assets"},434.35291279999984,406.08675122000056,709.10850396999786,561.10650204000012,748.30567498000119,690.05154192000032]
[{"$f":"HLOOKUP(INDICE!$F$2,Nombres!$C$3:$E$853,108)","v":"Total assets / Liabilities and equity"},15064.65617792,15842.26445642,16810.95090734,17483.769981330002,19504.911001250002,18427.698618010003]
[{"$f":"HLOOKUP(INDICE!$F$2,Nombres!$C$3:$E$853,109)","v":"Deposits from central banks and credit institutions"},1947.4469999999999,1967.221,1965.9970000000001,1946.385,2209.6759999999999,1865.6220000000001]
[{"$f":"HLOOKUP(INDICE!$F$2,Nombres!$C$3:$E$853,110)","v":"Deposits from customers"},7453.3860000000004,7645.6310000000003,7325.4009999999998,8240.0400000000009,8787.6049999999996,8401.7389999999996]
[{"$f":"HLOOKUP(INDICE!$F$2,Nombres!$C$3:$E$853,111)","v":"Debt certificates"},1936.8409999999999,2350.8739999999998,2608.7159999999999,2607.7640000000001,3052.125,2977.2440000000001]
[{"$f":"HLOOKUP(INDICE!$F$2,Nombres!$C$3:$E$853,112)","v":"Subordinated liabilities"},560.36800000000005,562.77599999999995,567.24199999999996,580.22299999999996,639.28099999999995,601.57299999999998]
[{"$f":"HLOOKUP(INDICE!$F$2,Nombres!$C$3:$E$853,114)","v":"Financial liabilities held for trading "},1134.4090000000001,1170.7,1712.415,1761.4290000000001,2128.2330000000002,2041.289]
[{"$f":"HLOOKUP(INDICE!$F$2,Nombres!$C$3:$E$853,115)","v":"Other liabilities"},1598.3264879199999,1701.93806642,2200.4800620399997,1891.2134075099998,2174.8175912500001,2016.2892480099999]
[{"$f":"HLOOKUP(INDICE!$F$2,Nombres!$C$3:$E$853,116)","v":"Economic capital allocated"},433.87869000000001,443.12439000000001,430.69984529999999,456.71557381999997,513.17340999999999,523.94236999999998]
[{"$f":"HLOOKUP(INDICE!$F$2,Nombres!$C$3:$E$853,117)","v":"Relevant business indicators"}]
[{"$f":"HLOOKUP(INDICE!$F$2,Nombres!$C$3:$E$853,201)","v":"Annex:"}]
[{"$f":"HLOOKUP(INDICE!$F$2,Nombres!$C$3:$E$853,30)","v":"(Million euros)"},"2014-03-31","2014-06-30","2014-09-30","2014-12-31","2015-03-31","2015-06-30"]
[{"$f":"HLOOKUP(INDICE!$F$2,Nombres!$C$3:$E$853,118)","v":"Loans and advances to customers gross"},11280.372265120001,11700.3487052,11778.64040337,12338.41047929,13621.572326270001,12871.361076089999]
[{"$f":"HLOOKUP(INDICE!$F$2,Nombres!$C$3:$E$853,121)","v":"Customer deposits under management (*)"},7734.8942334000003,7819.9671246600001,7724.4803081999999,8668.2063936400009,9163.1472334800001,8533.4707169499998]
[{"$f":"HLOOKUP(INDICE!$F$2,Nombres!$C$3:$E$853,122)","v":"Mutual funds"},1146.170613,1087.07284,1275.2735849999999,1281.660717,1441.0292039999999,1376.0938619999999]
[{"$f":"HLOOKUP(INDICE!$F$2,Nombres!$C$3:$E$853,206)","v":"Pension funds"},"0","0","0","0","0","0"]
[{"$f":"HLOOKUP(INDICE!$F$2,Nombres!$C$3:$E$853,284)","v":"(*) Excluding repos and including specific marketable debt securities."}]
[{"$f":"HLOOKUP(INDICE!$F$2,Nombres!$C$3:$E$853,93)","v":"Income statement  "}]
[{"$f":"HLOOKUP(INDICE!$F$2,Nombres!$C$3:$E$853,31)","v":"(Constant million euros)    "}]
[null,2014,null,null,null,2015]
[null,{"$f":"HLOOKUP(INDICE!$F$2,Nombres!$C$3:$E$857,34)","v":"1st Quarter"},{"$f":"HLOOKUP(INDICE!$F$2,Nombres!$C$3:$E$857,35)","v":"2nd Quarter"},{"$f":"HLOOKUP(INDICE!$F$2,Nombres!$C$3:$E$857,36)","v":"3rd Quarter"},{"$f":"HLOOKUP(INDICE!$F$2,Nombres!$C$3:$E$857,37)","v":"4th Quarter"},{"$f":"HLOOKUP(INDICE!$F$2,Nombres!$C$3:$E$857,34)","v":"1st Quarter"},{"$f":"HLOOKUP(INDICE!$F$2,Nombres!$C$3:$E$857,35)","v":"2nd Quarter"}]
[{"$f":"HLOOKUP(INDICE!$F$2,Nombres!$C$3:$E$853,38)","v":"Net interest income"},135.21476730609999,144.45503076,126.68492233480001,152.73573882829999,120.9410570432,139.98194348679999]
[{"$f":"HLOOKUP(INDICE!$F$2,Nombres!$C$3:$E$853,39)","v":"Net fees and commissions"},16.400908275299997,20.131155098600001,22.7178755011,23.777047877299999,22.5266070401,20.257166199899999]
[{"$f":"HLOOKUP(INDICE!$F$2,Nombres!$C$3:$E$853,40)","v":"Net trading income"},17.404750232799998,9.0667435305000001,31.059573654600001,-8.2219242839,28.271992082300002,19.064410927799997]
[{"$f":"HLOOKUP(INDICE!$F$2,Nombres!$C$3:$E$853,95)","v":"Other income/expenses"},3.2816265906999997,4.5094801618999991,0.3043864852999999,-1.6085423074999998,2.7348003797000002,3.9641978703]
[{"$f":"HLOOKUP(INDICE!$F$2,Nombres!$C$3:$E$853,44)","v":"Gross income"},172.3020524049,178.162409551,180.7667579758,166.68232011399999,174.47445654519998,183.26771848480001]
[{"$f":"HLOOKUP(INDICE!$F$2,Nombres!$C$3:$E$853,45)","v":"Operating expenses"},-79.690484714899995,-81.837063987500002,-83.387848649299997,-85.055917054399998,-84.550845626899999,-87.289916373099999]
[{"$f":"HLOOKUP(INDICE!$F$2,Nombres!$C$3:$E$853,46)","v":"  Administration expenses"},-76.248646248200004,-79.694928863299992,-80.240355919400002,-82.593763859299997,-81.947965595900001,-84.684795824100007]
[{"$f":"HLOOKUP(INDICE!$F$2,Nombres!$C$3:$E$853,47)","v":"  Personnel expenses"},-43.656199123299999,-43.478044233399999,-44.729203379499999,-45.557881563100004,-44.401169790099999,-44.611830359899997]
[{"$f":"HLOOKUP(INDICE!$F$2,Nombres!$C$3:$E$853,48)","v":"  General and administrative expenses"},-32.592447124899998,-36.216884629799999,-35.511152539900003,-37.035882296300002,-37.5467958057,-40.072965464199996]
[{"$f":"HLOOKUP(INDICE!$F$2,Nombres!$C$3:$E$853,49)","v":"  Depreciation and amortization"},-3.4418384667000002,-2.1421351243000002,-3.1474927299999997,-2.4621531951,-2.6028800310000002,-2.605120549]
[{"$f":"HLOOKUP(INDICE!$F$2,Nombres!$C$3:$E$853,50)","v":"Operating income"},92.611567690100003,96.325345563500008,97.378909326399992,81.626403059600008,89.9236109183,95.977802111599999]
[{"$f":"HLOOKUP(INDICE!$F$2,Nombres!$C$3:$E$853,51)","v":"Impairment on financial assets (net)"},-31.425576400599997,-28.787971446899999,-33.687812283299998,-20.739640890899999,-37.308958292999996,-34.425041637]
[{"$f":"HLOOKUP(INDICE!$F$2,Nombres!$C$3:$E$853,160)","v":"Provisions (net) and other gains/losses"},0.57218677390000006,0.47508198730000006,-2.4858838177,-59.495934605999999,-1.1101553063,4.8531551963000004]
[{"$f":"HLOOKUP(INDICE!$F$2,Nombres!$C$3:$E$853,54)","v":"Income before tax"},61.758178063399995,68.012456104000009,61.205213225600005,1.3908275626999966,51.504497319000002,66.405915671000002]
[{"$f":"HLOOKUP(INDICE!$F$2,Nombres!$C$3:$E$853,55)","v":"Income tax"},-7.4467430971000006,-4.7351816770999999,16.861843305999997,10.859790743100001,-9.2057072007999992,-9.0166967090999997]
[{"$f":"HLOOKUP(INDICE!$F$2,Nombres!$C$3:$E$853,56)","v":"Net income"},54.311434966299998,63.2772744269,78.067056531600002,12.250618305800003,42.298790118200003,57.389218961799997]
[{"$f":"HLOOKUP(INDICE!$F$2,Nombres!$C$3:$E$853,57)","v":"Non-controlling interests"},-15.552556771799999,-17.162715204800001,-23.70415629,-3.1203689083999988,-11.6464366521,-13.7843606679]
[{"$f":"HLOOKUP(INDICE!$F$2,Nombres!$C$3:$E$853,58)","v":"Net attributable profit"},38.758878194399998,46.114559222099999,54.3629002415,9.1302493972999965,30.652353466000001,43.604858293900001]
[]
[{"$f":"HLOOKUP(INDICE!$F$2,Nombres!$C$3:$E$853,94)","v":"Balance sheet  "}]
[{"$f":"HLOOKUP(INDICE!$F$2,Nombres!$C$3:$E$853,31)","v":"(Constant million euros)    "}]
[null,"2014-03-31","2014-06-30","2014-09-30","2014-12-31","2015-03-31","2015-06-30"]
[{"$f":"HLOOKUP(INDICE!$F$2,Nombres!$C$3:$E$853,100)","v":"Cash and balances with central banks"},408.34886560360002,383.66412030079999,394.9338743376,611.47977008110001,376.87023600809999,592.29499999999996]
[{"$f":"HLOOKUP(INDICE!$F$2,Nombres!$C$3:$E$853,101)","v":"Financial assets"},1705.4782201974001,1997.0394466165001,2374.5275155185,2729.9107089167001,2753.1887687121002,2676.4870000000001]
[{"$f":"HLOOKUP(INDICE!$F$2,Nombres!$C$3:$E$853,102)","v":"Loans and receivables"},13439.389149042499,13872.9908698659,14302.800175582899,14124.785688165301,14562.528460814699,14360.630076089999]
[{"$f":"HLOOKUP(INDICE!$F$2,Nombres!$C$3:$E$853,103)","v":"  . Loans and advances to customers"},11805.6002591412,12140.4415766328,12309.118007528399,12581.268022726799,12719.104223458,12658.02807609]
[{"$f":"HLOOKUP(INDICE!$F$2,Nombres!$C$3:$E$853,104)","v":"  . Loans and advances to credit institutions and other"},1633.7888899013001,1732.5492932330999,1993.6821680544999,1543.5176654385,1843.4242373566999,1702.6020000000001]
[{"$f":"HLOOKUP(INDICE!$F$2,Nombres!$C$3:$E$853,106)","v":"Tangible assets"},87.988774487499995,87.7628631579,90.0352581378,92.490140014700003,115.4370114633,108.235]
[{"$f":"HLOOKUP(INDICE!$F$2,Nombres!$C$3:$E$853,107)","v":"Other assets"},464.36514899199994,429.90236520140337,755.8098210370008,582.19451353880333,710.46149047310337,690.05154192000032]
[{"$f":"HLOOKUP(INDICE!$F$2,Nombres!$C$3:$E$853,108)","v":"Total assets / Liabilities and equity"},16105.570158323098,16771.359665142401,17918.106644613697,18140.860820716702,18518.485967471301,18427.698618010003]
[{"$f":"HLOOKUP(INDICE!$F$2,Nombres!$C$3:$E$853,109)","v":"Deposits from central banks and credit institutions"},2082.0086378132,2082.5918556390998,2095.4759848600002,2019.5357995577999,2097.9256965610002,1865.6220000000001]
[{"$f":"HLOOKUP(INDICE!$F$2,Nombres!$C$3:$E$853,110)","v":"Deposits from customers"},7968.3883735763002,8094.0213894736999,7807.8460317940999,8549.7246278555995,8343.1880242750995,8401.7389999999996]
[{"$f":"HLOOKUP(INDICE!$F$2,Nombres!$C$3:$E$853,111)","v":"Debt certificates"},2070.6698010629998,2488.744806015,2780.5239424678002,2705.7713426676,2897.769386379,2977.2440000000001]
[{"$f":"HLOOKUP(INDICE!$F$2,Nombres!$C$3:$E$853,112)","v":"Subordinated liabilities"},599.08742900530001,595.78090827070002,604.60010295229995,602.02946499630002,606.95053809839999,601.57299999999998]
[{"$f":"HLOOKUP(INDICE!$F$2,Nombres!$C$3:$E$853,114)","v":"Financial liabilities held for trading "},1212.7926135155999,1239.357593985,1825.1932778198,1827.6286160648001,2020.6015266351999,2041.289]
[{"$f":"HLOOKUP(INDICE!$F$2,Nombres!$C$3:$E$853,115)","v":"Other liabilities"},1708.7651442607998,1801.7509755785004,2345.4019132115995,1962.2906984332999,2064.8301877815006,2016.2892480099999]
[{"$f":"HLOOKUP(INDICE!$F$2,Nombres!$C$3:$E$853,116)","v":"Economic capital allocated"},463.85815908879999,469.11213618049999,459.06539150830002,473.88027114120001,487.22060774110003,523.94236999999998]
[{"$f":"HLOOKUP(INDICE!$F$2,Nombres!$C$3:$E$853,117)","v":"Relevant business indicators"}]
[{"$f":"HLOOKUP(INDICE!$F$2,Nombres!$C$3:$E$853,201)","v":"Annex:"}]
[{"$f":"HLOOKUP(INDICE!$F$2,Nombres!$C$3:$E$853,31)","v":"(Constant million euros)    "}]
[null,"2014-03-31","2014-06-30","2014-09-30","2014-12-31","2015-03-31","2015-06-30"]
[{"$f":"HLOOKUP(INDICE!$F$2,Nombres!$C$3:$E$853,118)","v":"Loans and advances to customers gross"},12059.805732186,12386.534569114001,12554.372208891,12802.1237692264,12932.6863353932,12871.361076089999]
[{"$f":"HLOOKUP(INDICE!$F$2,Nombres!$C$3:$E$853,121)","v":"Customer deposits under management (*)"},8269.3478212811006,8278.5817379859,8233.2083830020001,8993.9827577341002,8699.7378993525999,8533.4707169499998]
[{"$f":"HLOOKUP(INDICE!$F$2,Nombres!$C$3:$E$853,122)","v":"Mutual funds"},1225.366912,1150.8259840000001,1359.26208,1329.829248,1368.1517998867,1376.0938619999999]
[{"$f":"HLOOKUP(INDICE!$F$2,Nombres!$C$3:$E$853,206)","v":"Pension funds"},"0","0","0","0","0","0"]
[{"$f":"HLOOKUP(INDICE!$F$2,Nombres!$C$3:$E$853,284)","v":"(*) Excluding repos and including specific marketable debt securities."}]

{"sheet":"Colombia","index":12,"n_rows":99,"n_cols":7,"rows_kept":99,"cut":false,"hidden":false,"merged":[[3,1,3,4],[3,5,3,6],[51,1,51,4],[51,5,51,6]]}
[{"$f":"HLOOKUP(INDICE!$F$2,Nombres!$C$3:$E$853,17)","v":"Colombia"}]
[{"$f":"HLOOKUP(INDICE!$F$2,Nombres!$C$3:$E$853,93)","v":"Income statement  "}]
[{"$f":"HLOOKUP(INDICE!$F$2,Nombres!$C$3:$E$853,30)","v":"(Million euros)"}]
[null,2014,null,null,null,2015]
[null,{"$f":"HLOOKUP(INDICE!$F$2,Nombres!$C$3:$E$857,34)","v":"1st Quarter"},{"$f":"HLOOKUP(INDICE!$F$2,Nombres!$C$3:$E$857,35)","v":"2nd Quarter"},{"$f":"HLOOKUP(INDICE!$F$2,Nombres!$C$3:$E$857,36)","v":"3rd Quarter"},{"$f":"HLOOKUP(INDICE!$F$2,Nombres!$C$3:$E$857,37)","v":"4th Quarter"},{"$f":"HLOOKUP(INDICE!$F$2,Nombres!$C$3:$E$857,34)","v":"1st Quarter"},{"$f":"HLOOKUP(INDICE!$F$2,Nombres!$C$3:$E$857,35)","v":"2nd Quarter"}]
[{"$f":"HLOOKUP(INDICE!$F$2,Nombres!$C$3:$E$853,38)","v":"Net interest income"},181.29299985,197.30700003000001,201.58499968000001,202.14399989999998,201.23500084,201.65216625000002]
[{"$f":"HLOOKUP(INDICE!$F$2,Nombres!$C$3:$E$853,39)","v":"Net fees and commissions"},20.67100061,22.02409432,24.495681230000002,22.375278520000002,17.859322470000002,21.50788816]
[{"$f":"HLOOKUP(INDICE!$F$2,Nombres!$C$3:$E$853,40)","v":"Net trading income"},15.204223420000002,12.079624259999999,16.26768337,20.633664230000001,17.722368629999998,10.524855899999999]
[{"$f":"HLOOKUP(INDICE!$F$2,Nombres!$C$3:$E$853,95)","v":"Other income/expenses"},5.3089997000000002,3.7850001,5.5409985900000009,4.2029994100000003,11.681000469999999,5.0650002399999998]
[{"$f":"HLOOKUP(INDICE!$F$2,Nombres!$C$3:$E$853,44)","v":"Gross income"},222.47722358000001,235.19571870999999,247.88936287000001,249.35594205999999,248.49769241000001,238.74991054999998]
[{"$f":"HLOOKUP(INDICE!$F$2,Nombres!$C$3:$E$853,45)","v":"Operating expenses"},-91.844307459999996,-95.747496259999991,-102.06790033000001,-105.40090380000001,-97.210898999999984,-94.47689668999999]
[{"$f":"HLOOKUP(INDICE!$F$2,Nombres!$C$3:$E$853,46)","v":"  Administration expenses"},-84.92330604,-88.378498039999997,-94.526900119999993,-103.79490383999999,-91.129898520000012,-90.549896939999996]
[{"$f":"HLOOKUP(INDICE!$F$2,Nombres!$C$3:$E$853,47)","v":"  Personnel expenses"},-42.928001199999997,-44.695997309999996,-47.791000980000007,-45.70400042,-45.572002230000002,-44.505998939999998]
[{"$f":"HLOOKUP(INDICE!$F$2,Nombres!$C$3:$E$853,48)","v":"  General and administrative expenses"},-41.995304840000003,-43.682500730000001,-46.735899140000001,-58.090903420000004,-45.557896290000002,-46.043897999999999]
[{"$f":"HLOOKUP(INDICE!$F$2,Nombres!$C$3:$E$853,49)","v":"  Depreciation and amortization"},-6.9210014199999996,-7.368998219999999,-7.54100021,-1.6059999600000001,-6.0810004800000002,-3.9269997500000002]
[{"$f":"HLOOKUP(INDICE!$F$2,Nombres!$C$3:$E$853,50)","v":"Operating income"},130.63291612,139.44822245,145.82146254,143.95503826000001,151.28679341,144.27301385999999]
[{"$f":"HLOOKUP(INDICE!$F$2,Nombres!$C$3:$E$853,51)","v":"Impairment on financial assets (net)"},-35.922999529999998,-39.57000034,-44.443999149999996,-37.29600164,-37.739000250000004,-47.492999789999999]
[{"$f":"HLOOKUP(INDICE!$F$2,Nombres!$C$3:$E$853,160)","v":"Provisions (net) and other gains/losses"},3.9999910000000305E-2,0.87600060000000024,1.46699954,-2.8909995100000003,-3.2040003399999999,12.352999749999999]
[{"$f":"HLOOKUP(INDICE!$F$2,Nombres!$C$3:$E$853,54)","v":"Income before tax"},94.749916500000012,100.75422270999999,102.84446293000001,103.76803710999999,110.34379282,109.13301382]
[{"$f":"HLOOKUP(INDICE!$F$2,Nombres!$C$3:$E$853,55)","v":"Income tax"},-31.148443480000001,-27.586656859999998,-32.25873859,-30.805990080000001,-35.358676800000005,-18.16604096]
[{"$f":"HLOOKUP(INDICE!$F$2,Nombres!$C$3:$E$853,56)","v":"Net income"},63.60147302,73.167565850000003,70.585724339999999,72.962047029999994,74.985116019999992,90.966972859999998]
[{"$f":"HLOOKUP(INDICE!$F$2,Nombres!$C$3:$E$853,57)","v":"Non-controlling interests"},-2.56094,-2.9219819999999999,-2.7739029999999998,-2.8535161599999999,-2.872074,-3.64946606]
[{"$f":"HLOOKUP(INDICE!$F$2,Nombres!$C$3:$E$853,58)","v":"Net attributable profit"},61.040533019999998,70.245583849999989,67.811821339999995,70.108530869999996,72.113042019999995,87.31750679999999]
[{"$f":"HLOOKUP(INDICE!$F$2,Nombres!$C$3:$E$853,94)","v":"Balance sheet  "}]
[{"$f":"HLOOKUP(INDICE!$F$2,Nombres!$C$3:$E$853,30)","v":"(Million euros)"}]
[null,"2014-03-31","2014-06-30","2014-09-30","2014-12-31","2015-03-31","2015-06-30"]
[{"$f":"HLOOKUP(INDICE!$F$2,Nombres!$C$3:$E$853,100)","v":"Cash and balances with central banks"},1246.519,1108.905,1019.654,974.28399999999999,1778.8340000000001,1174.037]
[{"$f":"HLOOKUP(INDICE!$F$2,Nombres!$C$3:$E$853,101)","v":"Financial assets"},2843.8620000000001,2487.0430000000001,2206.299,2827.27,2988.4540000000002,2787.0129999999999]
[{"$f":"HLOOKUP(INDICE!$F$2,Nombres!$C$3:$E$853,102)","v":"Loans and receivables"},10058.038,11084.38,11688.484,10681.384,11563.272000000001,11705.355]
[{"$f":"HLOOKUP(INDICE!$F$2,Nombres!$C$3:$E$853,103)","v":"  . Loans and advances to customers"},9724.8690000000006,10933.111000000001,11470.769,10476.719999999999,11057.996999999999,11134.859]
[{"$f":"HLOOKUP(INDICE!$F$2,Nombres!$C$3:$E$853,104)","v":"  . Loans and advances to credit institutions and other"},333.16899999999998,151.26900000000001,217.715,204.66399999999999,505.27499999999998,570.49599999999998]
[{"$f":"HLOOKUP(INDICE!$F$2,Nombres!$C$3:$E$853,106)","v":"Tangible assets"},117.408,119.252,118.98,121.417,124.813,117.215]
[{"$f":"HLOOKUP(INDICE!$F$2,Nombres!$C$3:$E$853,107)","v":"Other assets"},248.60578496999494,300.89299303000001,322.80548247000144,222.95656885999841,290.02872138999606,307.98899999999998]
[{"$f":"HLOOKUP(INDICE!$F$2,Nombres!$C$3:$E$853,108)","v":"Total assets / Liabilities and equity"},14514.432784969997,15100.47299303,15356.222482470001,14827.311568859999,16745.401721389997,16091.609]
[{"$f":"HLOOKUP(INDICE!$F$2,Nombres!$C$3:$E$853,109)","v":"Deposits from central banks and credit institutions"},382.89400000000001,389.56299999999999,308.25700000000001,754.19100000000003,1227.9839999999999,671.88]
[{"$f":"HLOOKUP(INDICE!$F$2,Nombres!$C$3:$E$853,110)","v":"Deposits from customers"},11551.877,11930.576999999999,11764.355,10779.151,11536.393,11202.465]
[{"$f":"HLOOKUP(INDICE!$F$2,Nombres!$C$3:$E$853,111)","v":"Debt certificates"},245.018,247.47,251.55699999999999,214.64500000000001,211.82900000000001,207.869]
[{"$f":"HLOOKUP(INDICE!$F$2,Nombres!$C$3:$E$853,112)","v":"Subordinated liabilities"},270.23200000000003,285.029,287.24599999999998,338.899,373.71800000000002,712.57600000000002]
[{"$f":"HLOOKUP(INDICE!$F$2,Nombres!$C$3:$E$853,114)","v":"Financial liabilities held for trading "},99.846000000000004,114.02800000000001,535.08199999999999,680.81399999999996,1216.6079999999999,1118.365]
[{"$f":"HLOOKUP(INDICE!$F$2,Nombres!$C$3:$E$853,115)","v":"Other liabilities"},1112.7237849700002,1228.8875830300001,1303.8125239799999,1170.5470039999998,1267.1755913899999,1328.648979999999]
[{"$f":"HLOOKUP(INDICE!$F$2,Nombres!$C$3:$E$853,116)","v":"Economic capital allocated"},851.84199999999998,904.91840999999999,905.91295849000005,889.06456486000002,911.69412999999997,849.80502000000001]
[{"$f":"HLOOKUP(INDICE!$F$2,Nombres!$C$3:$E$853,117)","v":"Relevant business indicators"}]
[{"$f":"HLOOKUP(INDICE!$F$2,Nombres!$C$3:$E$853,201)","v":"Annex:"}]
[{"$f":"HLOOKUP(INDICE!$F$2,Nombres!$C$3:$E$853,30)","v":"(Million euros)"},"2014-03-31","2014-06-30","2014-09-30","2014-12-31","2015-03-31","2015-06-30"]
[{"$f":"HLOOKUP(INDICE!$F$2,Nombres!$C$3:$E$853,118)","v":"Loans and advances to customers gross"},10044.656000000001,11284.700999999999,11842.584999999999,10816.282999999999,11425.763000000001,11504.851000000001]
[{"$f":"HLOOKUP(INDICE!$F$2,Nombres!$C$3:$E$853,121)","v":"Customer deposits under management (*)"},11565.803032420001,11935.74776009,11926.887464380001,11002.60931571,11752.56221342,11401.301355109999]
[{"$f":"HLOOKUP(INDICE!$F$2,Nombres!$C$3:$E$853,122)","v":"Mutual funds"},700.57240402000002,669.71962384000005,750.69818310999995,669.37413530000003,769.73630184000001,708.02099112999997]
[{"$f":"HLOOKUP(INDICE!$F$2,Nombres!$C$3:$E$853,206)","v":"Pension funds"},"0","0","0","0","0","0"]
[{"$f":"HLOOKUP(INDICE!$F$2,Nombres!$C$3:$E$853,284)","v":"(*) Excluding repos and including specific marketable debt securities."}]
[{"$f":"HLOOKUP(INDICE!$F$2,Nombres!$C$3:$E$853,93)","v":"Income statement  "}]
[{"$f":"HLOOKUP(INDICE!$F$2,Nombres!$C$3:$E$853,31)","v":"(Constant million euros)    "}]
[null,2014,null,null,null,2015]
[null,{"$f":"HLOOKUP(INDICE!$F$2,Nombres!$C$3:$E$857,34)","v":"1st Quarter"},{"$f":"HLOOKUP(INDICE!$F$2,Nombres!$C$3:$E$857,35)","v":"2nd Quarter"},{"$f":"HLOOKUP(INDICE!$F$2,Nombres!$C$3:$E$857,36)","v":"3rd Quarter"},{"$f":"HLOOKUP(INDICE!$F$2,Nombres!$C$3:$E$857,37)","v":"4th Quarter"},{"$f":"HLOOKUP(INDICE!$F$2,Nombres!$C$3:$E$857,34)","v":"1st Quarter"},{"$f":"HLOOKUP(INDICE!$F$2,Nombres!$C$3:$E$857,35)","v":"2nd Quarter"}]
[{"$f":"HLOOKUP(INDICE!$F$2,Nombres!$C$3:$E$853,38)","v":"Net interest income"},179.79882677429998,187.60601181890001,183.7709109887,197.95095812369999,201.7939869535,201.09318013659998]
[{"$f":"HLOOKUP(INDICE!$F$2,Nombres!$C$3:$E$853,39)","v":"Net fees and commissions"},20.500635220300001,20.931970343499998,22.398631788199999,21.933605458300001,17.908931699100002,21.458278931000002]
[{"$f":"HLOOKUP(INDICE!$F$2,Nombres!$C$3:$E$853,40)","v":"Net trading income"},15.078913886300001,11.3981533515,14.896887259700001,20.087200664499999,17.771597431700002,10.475627098299999]
[{"$f":"HLOOKUP(INDICE!$F$2,Nombres!$C$3:$E$853,95)","v":"Other income/expenses"},5.2652442079999995,3.5598469957999996,5.0781572667999999,4.1352587067000002,11.713447693599999,5.0325530164999996]
[{"$f":"HLOOKUP(INDICE!$F$2,Nombres!$C$3:$E$853,44)","v":"Gross income"},220.64362008890001,223.49598250970001,226.14458730340004,244.10702295319999,249.18796377780001,238.0596391823]
[{"$f":"HLOOKUP(INDICE!$F$2,Nombres!$C$3:$E$853,45)","v":"Operating expenses"},-91.087348882000001,-90.95738537310001,-93.1319845923,-103.1173910566,-97.480929275000008,-94.206866415000007]
[{"$f":"HLOOKUP(INDICE!$F$2,Nombres!$C$3:$E$853,46)","v":"  Administration expenses"},-84.223388682500001,-83.953899685399989,-86.259980622,-101.4145148361,-91.383037127000009,-90.296758333100001]
[{"$f":"HLOOKUP(INDICE!$F$2,Nombres!$C$3:$E$853,47)","v":"  Personnel expenses"},-42.574198992299998,-42.4587673037,-43.611283219500002,-44.788002387700004,-45.698591125,-44.379410044899998]
[{"$f":"HLOOKUP(INDICE!$F$2,Nombres!$C$3:$E$853,48)","v":"  General and administrative expenses"},-41.649189690200004,-41.495132381799998,-42.648697402499998,-56.6265124484,-45.6844460019,-45.917348288100001]
[{"$f":"HLOOKUP(INDICE!$F$2,Nombres!$C$3:$E$853,49)","v":"  Depreciation and amortization"},-6.8639601994999992,-7.0034856877000005,-6.8720039702999998,-1.7028762204999999,-6.0978921478999997,-3.9101080820999998]
[{"$f":"HLOOKUP(INDICE!$F$2,Nombres!$C$3:$E$853,50)","v":"Operating income"},129.55627120689999,132.5385971366,133.01260271110002,140.9896318966,151.70703450280001,143.8527727673]
[{"$f":"HLOOKUP(INDICE!$F$2,Nombres!$C$3:$E$853,51)","v":"Impairment on financial assets (net)"},-35.626930852500003,-37.633749128799998,-40.679469087599998,-36.619832995400003,-37.843830806299998,-47.388169233799999]
[{"$f":"HLOOKUP(INDICE!$F$2,Nombres!$C$3:$E$853,160)","v":"Provisions (net) and other gains/losses"},3.9670240400000001E-2,0.84924423289999984,1.3749355741,-2.7502898487,-3.2129003409000001,12.361899750900001]
[{"$f":"HLOOKUP(INDICE!$F$2,Nombres!$C$3:$E$853,54)","v":"Income before tax"},93.969010594699995,95.754092240700004,93.708069197499995,101.61950905249999,110.65030335559999,108.8265032844]
[{"$f":"HLOOKUP(INDICE!$F$2,Nombres!$C$3:$E$853,55)","v":"Income tax"},-30.891725539199999,-26.106584199300002,-29.445837245,-30.1864585141,-35.456895346700001,-18.0678224133]
[{"$f":"HLOOKUP(INDICE!$F$2,Nombres!$C$3:$E$853,56)","v":"Net income"},63.077285055500006,69.647508041400002,64.262231952600004,71.433050538399996,75.193408008900008,90.758680871099997]
[{"$f":"HLOOKUP(INDICE!$F$2,Nombres!$C$3:$E$853,57)","v":"Non-controlling interests"},-2.5398333516,-2.7809592344,-2.5231911639,-2.7948309946999998,-2.8800519833,-3.6414880766]
[{"$f":"HLOOKUP(INDICE!$F$2,Nombres!$C$3:$E$853,58)","v":"Net attributable profit"},60.537451703899997,66.866548807000001,61.739040788600008,68.638219543700004,72.313356025600001,87.117192794299996]
[]
[{"$f":"HLOOKUP(INDICE!$F$2,Nombres!$C$3:$E$853,94)","v":"Balance sheet  "}]
[{"$f":"HLOOKUP(INDICE!$F$2,Nombres!$C$3:$E$853,31)","v":"(Constant million euros)    "}]
[null,"2014-03-31","2014-06-30","2014-09-30","2014-12-31","2015-03-31","2015-06-30"]
[{"$f":"HLOOKUP(INDICE!$F$2,Nombres!$C$3:$E$853,100)","v":"Cash and balances with central banks"},1168.8226937669001,986.32681233929998,900.00072448979995,979.9484418605,1704.9212299169001,1174.037]
[{"$f":"HLOOKUP(INDICE!$F$2,Nombres!$C$3:$E$853,101)","v":"Financial assets"},2666.6023089431001,2212.1256503855998,1947.3965663265001,2843.7076162791,2864.2800110803,2787.0129999999999]
[{"$f":"HLOOKUP(INDICE!$F$2,Nombres!$C$3:$E$853,102)","v":"Loans and receivables"},9431.1142222222006,9859.1143444730005,10316.876183673499,10743.485069767399,11082.803634349,11705.355]
[{"$f":"HLOOKUP(INDICE!$F$2,Nombres!$C$3:$E$853,103)","v":"  . Loans and advances to customers"},9118.7118536585003,9724.5665964010004,10124.709372449001,10537.6311627907,10598.523440443199,11134.859]
[{"$f":"HLOOKUP(INDICE!$F$2,Nombres!$C$3:$E$853,104)","v":"  . Loans and advances to credit institutions and other"},312.40236856370001,134.54774807199999,192.16681122450001,205.85390697669999,484.28019390579999,570.49599999999998]
[{"$f":"HLOOKUP(INDICE!$F$2,Nombres!$C$3:$E$853,106)","v":"Tangible assets"},110.0898861789,106.0699023136,105.0180612245,122.1229127907,119.6268642659,117.215]
[{"$f":"HLOOKUP(INDICE!$F$2,Nombres!$C$3:$E$853,107)","v":"Other assets"},233.11003143529902,267.63232799090019,284.92524728219769,224.25282798120188,277.97766648469769,307.98899999999998]
[{"$f":"HLOOKUP(INDICE!$F$2,Nombres!$C$3:$E$853,108)","v":"Total assets / Liabilities and equity"},13609.739142546399,13431.269037502301,13554.216782996498,14913.516868679,16049.609406096799,16091.609]
[{"$f":"HLOOKUP(INDICE!$F$2,Nombres!$C$3:$E$853,109)","v":"Deposits from central banks and credit institutions"},359.02797831980001,346.5007660668,272.08398469389999,758.57583139530004,1176.9597340719999,671.88]
[{"$f":"HLOOKUP(INDICE!$F$2,Nombres!$C$3:$E$853,110)","v":"Deposits from customers"},10831.8413062331,10611.772858611799,10383.8439540816,10841.8204825581,11057.0414903047,11202.465]
[{"$f":"HLOOKUP(INDICE!$F$2,Nombres!$C$3:$E$853,111)","v":"Debt certificates"},229.7458753388,220.1147043702,222.03755612239999,215.89293604650001,203.02724099720001,207.869]
[{"$f":"HLOOKUP(INDICE!$F$2,Nombres!$C$3:$E$853,112)","v":"Subordinated liabilities"},253.38827100270001,253.5219383033,253.5385612245,340.86934302330002,358.1895512465,712.57600000000002]
[{"$f":"HLOOKUP(INDICE!$F$2,Nombres!$C$3:$E$853,114)","v":"Financial liabilities held for trading "},93.622536585399999,101.42336246790001,472.29176530609999,684.77222093019998,1166.0564210525999,1118.365]
[{"$f":"HLOOKUP(INDICE!$F$2,Nombres!$C$3:$E$853,115)","v":"Other liabilities"},1043.3670178851,1093.0465391475002,1150.8141155538001,1177.3525098373,1214.5228659859999,1328.648979999999]
[{"$f":"HLOOKUP(INDICE!$F$2,Nombres!$C$3:$E$853,116)","v":"Economic capital allocated"},798.74615718159998,804.88886853470001,799.60684601410003,894.2335448883,873.81210243769999,849.80502000000001]
[{"$f":"HLOOKUP(INDICE!$F$2,Nombres!$C$3:$E$853,117)","v":"Relevant business indicators"}]
[{"$f":"HLOOKUP(INDICE!$F$2,Nombres!$C$3:$E$853,201)","v":"Annex:"}]
[{"$f":"HLOOKUP(INDICE!$F$2,Nombres!$C$3:$E$853,31)","v":"(Constant million euros)    "}]
[null,"2014-03-31","2014-06-30","2014-09-30","2014-12-31","2015-03-31","2015-06-30"]
[{"$f":"HLOOKUP(INDICE!$F$2,Nombres!$C$3:$E$853,118)","v":"Loans and advances to customers gross"},9418.5663306233,10037.2918920309,10452.8939030612,10879.1683662791,10951.008304709201,11504.851000000001]
[{"$f":"HLOOKUP(INDICE!$F$2,Nombres!$C$3:$E$853,121)","v":"Customer deposits under management (*)"},10844.8993203721,10616.372043679001,10527.303731315,11066.577974522301,11264.2286034441,11401.301355109999]
[{"$f":"HLOOKUP(INDICE!$F$2,Nombres!$C$3:$E$853,122)","v":"Mutual funds"},656.90528940629997,595.68891991939995,662.60604937769995,673.26584538899999,737.75279899350005,708.02099112999997]
[{"$f":"HLOOKUP(INDICE!$F$2,Nombres!$C$3:$E$853,206)","v":"Pension funds"},"0","0","0","0","0","0"]
[{"$f":"HLOOKUP(INDICE!$F$2,Nombres!$C$3:$E$853,284)","v":"(*) Excluding repos and including specific marketable debt securities."}]

{"sheet":"Perú","index":13,"n_rows":99,"n_cols":7,"rows_kept":99,"cut":false,"hidden":false,"merged":[[3,1,3,4],[3,5,3,6],[51,1,51,4],[51,5,51,6]]}
[{"$f":"HLOOKUP(INDICE!$F$2,Nombres!$C$3:$E$853,18)","v":"Peru"}]
[{"$f":"HLOOKUP(INDICE!$F$2,Nombres!$C$3:$E$853,93)","v":"Income statement  "}]
[{"$f":"HLOOKUP(INDICE!$F$2,Nombres!$C$3:$E$853,30)","v":"(Million euros)"}]
[null,2014,null,null,null,2015]
[null,{"$f":"HLOOKUP(INDICE!$F$2,Nombres!$C$3:$E$857,34)","v":"1st Quarter"},{"$f":"HLOOKUP(INDICE!$F$2,Nombres!$C$3:$E$857,35)","v":"2nd Quarter"},{"$f":"HLOOKUP(INDICE!$F$2,Nombres!$C$3:$E$857,36)","v":"3rd Quarter"},{"$f":"HLOOKUP(INDICE!$F$2,Nombres!$C$3:$E$857,37)","v":"4th Quarter"},{"$f":"HLOOKUP(INDICE!$F$2,Nombres!$C$3:$E$857,34)","v":"1st Quarter"},{"$f":"HLOOKUP(INDICE!$F$2,Nombres!$C$3:$E$857,35)","v":"2nd Quarter"}]
[{"$f":"HLOOKUP(INDICE!$F$2,Nombres!$C$3:$E$853,38)","v":"Net interest income"},166.85599969,171.48941416,177.25961470999999,185.02180048,189.05080909999998,191.35578784999998]
[{"$f":"HLOOKUP(INDICE!$F$2,Nombres!$C$3:$E$853,39)","v":"Net fees and commissions"},43.5330236,46.713892439999995,46.79410395,51.876790099999994,51.27394692,53.285336699999995]
[{"$f":"HLOOKUP(INDICE!$F$2,Nombres!$C$3:$E$853,40)","v":"Net trading income"},23.822358229999999,29.312395389999999,29.901446809999996,43.474498519999997,42.359523639999999,51.092704230000002]
[{"$f":"HLOOKUP(INDICE!$F$2,Nombres!$C$3:$E$853,95)","v":"Other income/expenses"},-4.4380003099999996,-2.3210002899999997,-3.9849992199999997,-3.6000000600000002,-5.768000090000001,-4.33800031]
[{"$f":"HLOOKUP(INDICE!$F$2,Nombres!$C$3:$E$853,44)","v":"Gross income"},229.77338121000003,245.1947017,249.97016625000003,276.77308904,276.91627957000003,291.39582846999997]
[{"$f":"HLOOKUP(INDICE!$F$2,Nombres!$C$3:$E$853,45)","v":"Operating expenses"},-85.529563749999994,-84.398423629999996,-92.031496720000007,-88.072414269999996,-100.67826446000001,-100.63826116999999]
[{"$f":"HLOOKUP(INDICE!$F$2,Nombres!$C$3:$E$853,46)","v":"  Administration expenses"},-79.585563379999996,-78.411424530000005,-85.651495409999995,-81.239415210000004,-93.137264239999993,-93.348261010000002]
[{"$f":"HLOOKUP(INDICE!$F$2,Nombres!$C$3:$E$853,47)","v":"  Personnel expenses"},-44.176999719999998,-43.992000300000001,-46.74899911,-45.301001470000003,-52.421999470000003,-52.096000179999997]
[{"$f":"HLOOKUP(INDICE!$F$2,Nombres!$C$3:$E$853,48)","v":"  General and administrative expenses"},-35.408563659999999,-34.419424229999997,-38.902496300000003,-35.938413740000001,-40.715264770000005,-41.252260830000004]
[{"$f":"HLOOKUP(INDICE!$F$2,Nombres!$C$3:$E$853,49)","v":"  Depreciation and amortization"},-5.9440003699999995,-5.9869991000000002,-6.3800013099999999,-6.8329990600000006,-7.541000219999999,-7.29000016]
[{"$f":"HLOOKUP(INDICE!$F$2,Nombres!$C$3:$E$853,50)","v":"Operating income"},144.24381746,160.79627807,157.93866953,188.70067476999998,176.23801510999999,190.75756730000001]
[{"$f":"HLOOKUP(INDICE!$F$2,Nombres!$C$3:$E$853,51)","v":"Impairment on financial assets (net)"},-35.731000210000005,-36.996000039999998,-32.329001050000002,-38.31699922,-38.324000440000006,-54.372999840000006]
[{"$f":"HLOOKUP(INDICE!$F$2,Nombres!$C$3:$E$853,160)","v":"Provisions (net) and other gains/losses"},-3.29199983,-1.2950016799999999,6.20100126,-4.1519991599999999,-2.7770000000000001,-9.7001500000000185E-2]
[{"$f":"HLOOKUP(INDICE!$F$2,Nombres!$C$3:$E$853,54)","v":"Income before tax"},105.22081742,122.50527635,131.81066974000001,146.23167639000002,135.13701467000001,136.28756595999999]
[{"$f":"HLOOKUP(INDICE!$F$2,Nombres!$C$3:$E$853,55)","v":"Income tax"},-28.738580839999997,-33.49256132,-36.481676419999999,-41.009929960000001,-37.463492700000003,-37.630597760000001]
[{"$f":"HLOOKUP(INDICE!$F$2,Nombres!$C$3:$E$853,56)","v":"Net income"},76.482236580000006,89.012715029999995,95.328993319999995,105.22174643,97.673521969999996,98.656968199999994]
[{"$f":"HLOOKUP(INDICE!$F$2,Nombres!$C$3:$E$853,57)","v":"Non-controlling interests"},-40.954314490000002,-47.674755379999993,-51.216644099999996,-56.939384869999998,-52.005374359999998,-52.704659059999997]
[{"$f":"HLOOKUP(INDICE!$F$2,Nombres!$C$3:$E$853,58)","v":"Net attributable profit"},35.527922090000004,41.337959650000002,44.112349219999999,48.282361559999998,45.668147610000005,45.952309139999997]
[{"$f":"HLOOKUP(INDICE!$F$2,Nombres!$C$3:$E$853,94)","v":"Balance sheet  "}]
[{"$f":"HLOOKUP(INDICE!$F$2,Nombres!$C$3:$E$853,30)","v":"(Million euros)"}]
[null,"2014-03-31","2014-06-30","2014-09-30","2014-12-31","2015-03-31","2015-06-30"]
[{"$f":"HLOOKUP(INDICE!$F$2,Nombres!$C$3:$E$853,100)","v":"Cash and balances with central banks"},2921.672,2557.3440000000001,3349.9479999999999,3858.3359999999998,4480.1419999999998,5227.0420000000004]
[{"$f":"HLOOKUP(INDICE!$F$2,Nombres!$C$3:$E$853,101)","v":"Financial assets"},1187.268,1034.711,1805.271,1192.5709999999999,1709.77,1292.6790000000001]
[{"$f":"HLOOKUP(INDICE!$F$2,Nombres!$C$3:$E$853,102)","v":"Loans and receivables"},10392.911,10862.712,11493.339,11865.819,13401.378000000001,13140.682000000001]
[{"$f":"HLOOKUP(INDICE!$F$2,Nombres!$C$3:$E$853,103)","v":"  . Loans and advances to customers"},10090.537,10567.752,11166.614,11529.554,12831.027,12606.984]
[{"$f":"HLOOKUP(INDICE!$F$2,Nombres!$C$3:$E$853,104)","v":"  . Loans and advances to credit institutions and other"},302.37400000000002,294.95999999999998,326.72500000000002,336.26499999999999,570.351,533.69799999999998]
[{"$f":"HLOOKUP(INDICE!$F$2,Nombres!$C$3:$E$853,106)","v":"Tangible assets"},212.553,216.81700000000001,228.999,237.65700000000001,257.01400000000001,236.328]
[{"$f":"HLOOKUP(INDICE!$F$2,Nombres!$C$3:$E$853,107)","v":"Other assets"},452.3925035700002,368.70102454000192,411.32505213000013,421.84888152000445,560.09864022999955,326.59154616999967]
[{"$f":"HLOOKUP(INDICE!$F$2,Nombres!$C$3:$E$853,108)","v":"Total assets / Liabilities and equity"},15166.79650357,15040.28502454,17288.88205213,17576.231881520001,20408.402640229997,20223.322546170002]
[{"$f":"HLOOKUP(INDICE!$F$2,Nombres!$C$3:$E$853,109)","v":"Deposits from central banks and credit institutions"},1748.655,1715.2159999999999,2486.7370000000001,2409.817,3306.0630000000001,3465.0230000000001]
[{"$f":"HLOOKUP(INDICE!$F$2,Nombres!$C$3:$E$853,110)","v":"Deposits from customers"},9479.1460000000006,9580.5499999999993,10359.986000000001,10522.248,11945.870999999999,12016.855]
[{"$f":"HLOOKUP(INDICE!$F$2,Nombres!$C$3:$E$853,111)","v":"Debt certificates"},1432.76,1498.4359999999999,1578.453,1605.44,1776.4390000000001,1683.337]
[{"$f":"HLOOKUP(INDICE!$F$2,Nombres!$C$3:$E$853,112)","v":"Subordinated liabilities"},368.55799999999999,370.47399999999999,639.351,661.78399999999999,723.279,667.55399999999997]
[{"$f":"HLOOKUP(INDICE!$F$2,Nombres!$C$3:$E$853,114)","v":"Financial liabilities held for trading "},112.498,84.125,150.321,195.39699999999999,291.71199999999999,264.005]
[{"$f":"HLOOKUP(INDICE!$F$2,Nombres!$C$3:$E$853,115)","v":"Other liabilities"},1599.5171435700001,1333.8908045400003,1603.2172955799999,1712.7943398999998,1877.0257402299999,1671.5233361700002]
[{"$f":"HLOOKUP(INDICE!$F$2,Nombres!$C$3:$E$853,116)","v":"Economic capital allocated"},425.66235999999998,457.59321999999997,470.81675654999998,468.75154162000001,488.0129,455.02521000000002]
[{"$f":"HLOOKUP(INDICE!$F$2,Nombres!$C$3:$E$853,117)","v":"Relevant business indicators"}]
[{"$f":"HLOOKUP(INDICE!$F$2,Nombres!$C$3:$E$853,201)","v":"Annex:"}]
[{"$f":"HLOOKUP(INDICE!$F$2,Nombres!$C$3:$E$853,30)","v":"(Million euros)"},"2014-03-31","2014-06-30","2014-09-30","2014-12-31","2015-03-31","2015-06-30"]
[{"$f":"HLOOKUP(INDICE!$F$2,Nombres!$C$3:$E$853,118)","v":"Loans and advances to customers gross"},10532.196,11026.949999999999,11658.323,12019.917000000001,13396.904,13148.773000000001]
[{"$f":"HLOOKUP(INDICE!$F$2,Nombres!$C$3:$E$853,121)","v":"Customer deposits under management (*)"},9204.7406256800004,9244.2890503899998,10030.573741349999,10192.873578410001,11642.38093453,11728.564920479999]
[{"$f":"HLOOKUP(INDICE!$F$2,Nombres!$C$3:$E$853,122)","v":"Mutual funds"},1082.32021446,1086.9410993900001,1192.7892898,1239.98400973,1369.3128405299999,1300.9553842099999]
[{"$f":"HLOOKUP(INDICE!$F$2,Nombres!$C$3:$E$853,206)","v":"Pension funds"},"0","0","0","0","0","0"]
[{"$f":"HLOOKUP(INDICE!$F$2,Nombres!$C$3:$E$853,284)","v":"(*) Excluding repos and including specific marketable debt securities."}]
[{"$f":"HLOOKUP(INDICE!$F$2,Nombres!$C$3:$E$853,93)","v":"Income statement  "}]
[{"$f":"HLOOKUP(INDICE!$F$2,Nombres!$C$3:$E$853,31)","v":"(Constant million euros)    "}]
[null,2014,null,null,null,2015]
[null,{"$f":"HLOOKUP(INDICE!$F$2,Nombres!$C$3:$E$857,34)","v":"1st Quarter"},{"$f":"HLOOKUP(INDICE!$F$2,Nombres!$C$3:$E$857,35)","v":"2nd Quarter"},{"$f":"HLOOKUP(INDICE!$F$2,Nombres!$C$3:$E$857,36)","v":"3rd Quarter"},{"$f":"HLOOKUP(INDICE!$F$2,Nombres!$C$3:$E$857,37)","v":"4th Quarter"},{"$f":"HLOOKUP(INDICE!$F$2,Nombres!$C$3:$E$857,34)","v":"1st Quarter"},{"$f":"HLOOKUP(INDICE!$F$2,Nombres!$C$3:$E$857,35)","v":"2nd Quarter"}]
[{"$f":"HLOOKUP(INDICE!$F$2,Nombres!$C$3:$E$853,38)","v":"Net interest income"},185.62453985880001,189.8547946727,191.65678304310001,196.23219135250002,188.26836198860002,192.1382349614]
[{"$f":"HLOOKUP(INDICE!$F$2,Nombres!$C$3:$E$853,39)","v":"Net fees and commissions"},48.4297687193,51.721882791599995,50.585652666800001,55.098189464800001,51.061733325999995,53.497550294]
[{"$f":"HLOOKUP(INDICE!$F$2,Nombres!$C$3:$E$853,40)","v":"Net trading income"},26.501979509400002,32.4643936497,32.368710328299997,46.504711273300003,42.1842052318,51.268022638199994]
[{"$f":"HLOOKUP(INDICE!$F$2,Nombres!$C$3:$E$853,95)","v":"Other income/expenses"},-4.9372019404000005,-2.5636091938000001,-4.3169757524000003,-3.810725294,-5.7441273807000002,-4.3618730192999999]
[{"$f":"HLOOKUP(INDICE!$F$2,Nombres!$C$3:$E$853,44)","v":"Gross income"},255.61908614709998,271.4774619204,270.29417028590001,294.02436679659996,275.77017316579997,292.54193487429995]
[{"$f":"HLOOKUP(INDICE!$F$2,Nombres!$C$3:$E$853,45)","v":"Operating expenses"},-95.150225014,-93.427615878599994,-99.562647553099993,-93.236939957099992,-100.2615753298,-101.05495030019999]
[{"$f":"HLOOKUP(INDICE!$F$2,Nombres!$C$3:$E$853,46)","v":"  Administration expenses"},-88.537622916000004,-86.799773277399993,-92.662035986299998,-85.982338732000002,-92.7517859461,-93.733739303999997]
[{"$f":"HLOOKUP(INDICE!$F$2,Nombres!$C$3:$E$853,47)","v":"  Personnel expenses"},-49.146181501499996,-48.699499564900002,-50.556421277800005,-47.955599105899999,-52.205034294099995,-52.312965356000007]
[{"$f":"HLOOKUP(INDICE!$F$2,Nombres!$C$3:$E$853,48)","v":"  General and administrative expenses"},-39.391441414599996,-38.100273712499998,-42.105614708399997,-38.026739626000001,-40.546751651900003,-41.420773947999997]
[{"$f":"HLOOKUP(INDICE!$F$2,Nombres!$C$3:$E$853,49)","v":"  Depreciation and amortization"},-6.6126020979,-6.6278426011999994,-6.9006115670000003,-7.2546012252000001,-7.5097893836999994,-7.3212109963000005]
[{"$f":"HLOOKUP(INDICE!$F$2,Nombres!$C$3:$E$853,50)","v":"Operating income"},160.46886113319999,178.04984604169999,170.73152273260001,200.78742683939998,175.50859783589999,191.48698457400002]
[{"$f":"HLOOKUP(INDICE!$F$2,Nombres!$C$3:$E$853,51)","v":"Impairment on financial assets (net)"},-39.750146743200006,-40.958751733,-34.846709799199999,-40.656515520399999,-38.165384332499997,-54.531615947400006]
[{"$f":"HLOOKUP(INDICE!$F$2,Nombres!$C$3:$E$853,160)","v":"Provisions (net) and other gains/losses"},-3.6622953612000004,-1.4281364991000001,6.865739511200001,-4.5405861662999998,-2.7655064992000002,-0.1084950008000003]
[{"$f":"HLOOKUP(INDICE!$F$2,Nombres!$C$3:$E$853,54)","v":"Income before tax"},117.0564190286,135.6629578095,142.75055244449999,155.59032515289999,134.57770700409998,136.8468736259]
[{"$f":"HLOOKUP(INDICE!$F$2,Nombres!$C$3:$E$853,55)","v":"Income tax"},-31.971195848699999,-37.089908244600004,-39.517365051300004,-43.656520796899997,-37.308438078600005,-37.7856523815]
[{"$f":"HLOOKUP(INDICE!$F$2,Nombres!$C$3:$E$853,56)","v":"Net income"},85.08522318,98.573049565000005,103.23318739319998,111.933804356,97.269268925600002,99.061221244400002]
[{"$f":"HLOOKUP(INDICE!$F$2,Nombres!$C$3:$E$853,57)","v":"Non-controlling interests"},-45.560997486199994,-52.7952467916,-55.466063277800004,-60.584994444700001,-51.790133520099999,-52.919899899900003]
[{"$f":"HLOOKUP(INDICE!$F$2,Nombres!$C$3:$E$853,58)","v":"Net attributable profit"},39.524225693700004,45.777802773299996,47.7671241153,51.348809911300002,45.479135405600005,46.1413213445]
[]
[{"$f":"HLOOKUP(INDICE!$F$2,Nombres!$C$3:$E$853,94)","v":"Balance sheet  "}]
[{"$f":"HLOOKUP(INDICE!$F$2,Nombres!$C$3:$E$853,31)","v":"(Constant million euros)    "}]
[null,"2014-03-31","2014-06-30","2014-09-30","2014-12-31","2015-03-31","2015-06-30"]
[{"$f":"HLOOKUP(INDICE!$F$2,Nombres!$C$3:$E$853,100)","v":"Cash and balances with central banks"},3183.9693383613999,2744.9229331105998,3430.7081126732,3925.2882184527998,4201.8815826918999,5227.0420000000004]
[{"$f":"HLOOKUP(INDICE!$F$2,Nombres!$C$3:$E$853,101)","v":"Financial assets"},1293.8567054815001,1110.6061417791,1848.7922395433,1213.2652252081,1603.5766441419,1292.6790000000001]
[{"$f":"HLOOKUP(INDICE!$F$2,Nombres!$C$3:$E$853,102)","v":"Loans and receivables"},11325.9496481187,11659.482370997501,11770.418928593301,12071.721986626801,12569.0220088766,13140.682000000001]
[{"$f":"HLOOKUP(INDICE!$F$2,Nombres!$C$3:$E$853,103)","v":"  . Loans and advances to customers"},10996.429584019301,11342.8873144269,11435.817284593701,11729.621909604501,12034.095356424599,12606.984]
[{"$f":"HLOOKUP(INDICE!$F$2,Nombres!$C$3:$E$853,104)","v":"  . Loans and advances to credit institutions and other"},329.52006409950002,316.59505657049999,334.60164399960001,342.10007702230001,534.92665245210003,533.69799999999998]
[{"$f":"HLOOKUP(INDICE!$F$2,Nombres!$C$3:$E$853,106)","v":"Tangible assets"},231.63525364130001,232.7203362505,234.519678244,241.78097038019999,241.05092943349999,236.328]
[{"$f":"HLOOKUP(INDICE!$F$2,Nombres!$C$3:$E$853,107)","v":"Other assets"},493.00669625859916,395.74492040239682,421.24122323329578,429.16906267309531,525.31106399600299,326.59154616999967]
[{"$f":"HLOOKUP(INDICE!$F$2,Nombres!$C$3:$E$853,108)","v":"Total assets / Liabilities and equity"},16528.417641861597,16143.47670254,17705.680182287098,17881.225463340998,19140.842229140002,20223.322546170002]
[{"$f":"HLOOKUP(INDICE!$F$2,Nombres!$C$3:$E$853,109)","v":"Deposits from central banks and credit institutions"},1905.6430370597,1841.0255849969001,2546.6869336433001,2451.6336261869001,3100.7243143005999,3465.0230000000001]
[{"$f":"HLOOKUP(INDICE!$F$2,Nombres!$C$3:$E$853,110)","v":"Deposits from customers"},10330.150070867199,10283.2749160117,10609.7432012021,10704.836516580899,11203.9161580399,12016.855]
[{"$f":"HLOOKUP(INDICE!$F$2,Nombres!$C$3:$E$853,111)","v":"Debt certificates"},1561.3881055884001,1608.3449626638001,1616.5061405649999,1633.2985819360999,1666.1048504435,1683.337]
[{"$f":"HLOOKUP(INDICE!$F$2,Nombres!$C$3:$E$853,112)","v":"Subordinated liabilities"},401.64582862409998,397.64794205290002,654.76439113260005,673.26768284579998,678.35633541250002,667.55399999999997]
[{"$f":"HLOOKUP(INDICE!$F$2,Nombres!$C$3:$E$853,114)","v":"Financial liabilities held for trading "},122.5976710004,90.2954947586,153.9449192063,198.78764887790001,273.59384596519999,264.005]
[{"$f":"HLOOKUP(INDICE!$F$2,Nombres!$C$3:$E$853,115)","v":"Other liabilities"},1743.116113414,1431.7305218411002,1641.8674505766,1742.5158003455001,1760.4441752317,1671.5233361700002]
[{"$f":"HLOOKUP(INDICE!$F$2,Nombres!$C$3:$E$853,116)","v":"Economic capital allocated"},463.876815308,491.15728021490003,482.16714596119999,476.88560656790003,457.7025497464,455.02521000000002]
[{"$f":"HLOOKUP(INDICE!$F$2,Nombres!$C$3:$E$853,117)","v":"Relevant business indicators"}]
[{"$f":"HLOOKUP(INDICE!$F$2,Nombres!$C$3:$E$853,201)","v":"Annex:"}]
[{"$f":"HLOOKUP(INDICE!$F$2,Nombres!$C$3:$E$853,31)","v":"(Constant million euros)    "}]
[null,"2014-03-31","2014-06-30","2014-09-30","2014-12-31","2015-03-31","2015-06-30"]
[{"$f":"HLOOKUP(INDICE!$F$2,Nombres!$C$3:$E$853,118)","v":"Loans and advances to customers gross"},11477.739160868101,11835.767083843399,11939.380341505101,12228.493989865301,12564.825887816001,13148.773000000001]
[{"$f":"HLOOKUP(INDICE!$F$2,Nombres!$C$3:$E$853,121)","v":"Customer deposits under management (*)"},10031.109556354801,9922.3495215031999,10272.3895144689,10369.7465875216,10919.2757790903,11728.564920479999]
[{"$f":"HLOOKUP(INDICE!$F$2,Nombres!$C$3:$E$853,122)","v":"Mutual funds"},1179.4870803873,1166.6672730207999,1221.5448995705001,1261.5009746333999,1284.2651874799001,1300.9553842099999]
[{"$f":"HLOOKUP(INDICE!$F$2,Nombres!$C$3:$E$853,206)","v":"Pension funds"},"0","0","0","0","0","0"]
[{"$f":"HLOOKUP(INDICE!$F$2,Nombres!$C$3:$E$853,284)","v":"(*) Excluding repos and including specific marketable debt securities."}]

{"sheet":"Venezuela","index":14,"n_rows":99,"n_cols":7,"rows_kept":99,"cut":false,"hidden":false,"merged":[[3,1,3,4],[3,5,3,6],[51,1,51,4],[51,5,51,6]]}
[{"$f":"HLOOKUP(INDICE!$F$2,Nombres!$C$3:$E$853,19)","v":"Venezuela"}]
[{"$f":"HLOOKUP(INDICE!$F$2,Nombres!$C$3:$E$853,93)","v":"Income statement  "}]
[{"$f":"HLOOKUP(INDICE!$F$2,Nombres!$C$3:$E$853,30)","v":"(Million euros)"}]
[null,2014,null,null,null,2015]
[null,{"$f":"HLOOKUP(INDICE!$F$2,Nombres!$C$3:$E$857,34)","v":"1st Quarter"},{"$f":"HLOOKUP(INDICE!$F$2,Nombres!$C$3:$E$857,35)","v":"2nd Quarter"},{"$f":"HLOOKUP(INDICE!$F$2,Nombres!$C$3:$E$857,36)","v":"3rd Quarter"},{"$f":"HLOOKUP(INDICE!$F$2,Nombres!$C$3:$E$857,37)","v":"4th Quarter"},{"$f":"HLOOKUP(INDICE!$F$2,Nombres!$C$3:$E$857,34)","v":"1st Quarter"},{"$f":"HLOOKUP(INDICE!$F$2,Nombres!$C$3:$E$857,35)","v":"2nd Quarter"}]
[{"$f":"HLOOKUP(INDICE!$F$2,Nombres!$C$3:$E$853,38)","v":"Net interest income"},293.15199927999998,447.22900023,508.32299983999997,676.2730004,38.962999400000001,54.946001279999997]
[{"$f":"HLOOKUP(INDICE!$F$2,Nombres!$C$3:$E$853,39)","v":"Net fees and commissions"},36.98000004,67.181591130000001,83.365823750000004,115.63196001,6.1659992899999949,8.2779983599999998]
[{"$f":"HLOOKUP(INDICE!$F$2,Nombres!$C$3:$E$853,40)","v":"Net trading income"},70.667984939999997,10.53298479,19.131443769999997,10.32038517,71.920994379999996,17.611951560000001]
[{"$f":"HLOOKUP(INDICE!$F$2,Nombres!$C$3:$E$853,95)","v":"Other income/expenses"},-118.02899889,-260.21200105000003,-244.38500126000002,-351.98499984,-23.246000219999985,-47.164001209999995]
[{"$f":"HLOOKUP(INDICE!$F$2,Nombres!$C$3:$E$853,44)","v":"Gross income"},282.77098537000001,264.73157509999999,366.43526610000004,450.24034574000001,93.80399285,33.671949990000002]
[{"$f":"HLOOKUP(INDICE!$F$2,Nombres!$C$3:$E$853,45)","v":"Operating expenses"},-93.560002869999991,-139.40999313,-159.47899946999999,-240.76400197999999,-14.720005100000009,-18.75299162]
[{"$f":"HLOOKUP(INDICE!$F$2,Nombres!$C$3:$E$853,46)","v":"  Administration expenses"},-81.991001819999994,-122.06299505000001,-139.8629995,-196.02999986999998,-12.88100326,-16.40799458]
[{"$f":"HLOOKUP(INDICE!$F$2,Nombres!$C$3:$E$853,47)","v":"  Personnel expenses"},-36.410000940000003,-54.712000490000001,-58.107997869999998,-82.523998419999998,-5.4259992600000047,-6.8300010200000001]
[{"$f":"HLOOKUP(INDICE!$F$2,Nombres!$C$3:$E$853,48)","v":"  General and administrative expenses"},-45.581000879999998,-67.350994560000004,-81.755001629999995,-113.50600145000001,-7.4550039999999882,-9.5779935599999995]
[{"$f":"HLOOKUP(INDICE!$F$2,Nombres!$C$3:$E$853,49)","v":"  Depreciation and amortization"},-11.569001050000001,-17.346998079999999,-19.615999969999997,-44.734002109999999,-1.8390018399999999,-2.34499704]
[{"$f":"HLOOKUP(INDICE!$F$2,Nombres!$C$3:$E$853,50)","v":"Operating income"},189.2109825,125.32158197000001,206.95626663000002,209.47634375999999,79.083987750000006,14.91895837]
[{"$f":"HLOOKUP(INDICE!$F$2,Nombres!$C$3:$E$853,51)","v":"Impairment on financial assets (net)"},-21.193000559999998,-50.419999200000007,-69.481000550000005,-88.365999790000004,-3.3990001700000008,-6.376000079999999]
[{"$f":"HLOOKUP(INDICE!$F$2,Nombres!$C$3:$E$853,160)","v":"Provisions (net) and other gains/losses"},-16.640000450000002,-19.327999519999999,-26.686999630000003,-42.306000850000004,-28.713999289999997,-1.8560006000000002]
[{"$f":"HLOOKUP(INDICE!$F$2,Nombres!$C$3:$E$853,54)","v":"Income before tax"},151.37798149,55.573583249999999,110.78826644999999,78.804343119999999,46.970988290000001,6.6869576899999998]
[{"$f":"HLOOKUP(INDICE!$F$2,Nombres!$C$3:$E$853,55)","v":"Income tax"},-49.087054179999996,-24.361553239999999,-22.775197690000002,-6.5219781399999999,-20.878998030000005,-16.37098374]
[{"$f":"HLOOKUP(INDICE!$F$2,Nombres!$C$3:$E$853,56)","v":"Net income"},102.29092731,31.212030009999999,88.01306876000001,72.282364979999997,26.091990259999996,-9.6840260499999999]
[{"$f":"HLOOKUP(INDICE!$F$2,Nombres!$C$3:$E$853,57)","v":"Non-controlling interests"},-45.752980999999998,-13.643652000000001,-39.487663999999995,-32.441820999999997,-11.507998000000001,4.2990139999999997]
[{"$f":"HLOOKUP(INDICE!$F$2,Nombres!$C$3:$E$853,58)","v":"Net attributable profit"},56.537946309999995,17.56837801,48.525404760000001,39.84054398,14.583992260000002,-5.3850120500000003]
[{"$f":"HLOOKUP(INDICE!$F$2,Nombres!$C$3:$E$853,94)","v":"Balance sheet  "}]
[{"$f":"HLOOKUP(INDICE!$F$2,Nombres!$C$3:$E$853,30)","v":"(Million euros)"}]
[null,"2014-03-31","2014-06-30","2014-09-30","2014-12-31","2015-03-31","2015-06-30"]
[{"$f":"HLOOKUP(INDICE!$F$2,Nombres!$C$3:$E$853,100)","v":"Cash and balances with central banks"},4575.7650000000003,4484.0690000000004,3724.8560000000002,5762.085,549.40599999999995,440.28500000000003]
[{"$f":"HLOOKUP(INDICE!$F$2,Nombres!$C$3:$E$853,101)","v":"Financial assets"},1767.335,1763.6369999999999,1699.7719999999999,1756.1780000000001,253.398,264.31]
[{"$f":"HLOOKUP(INDICE!$F$2,Nombres!$C$3:$E$853,102)","v":"Loans and receivables"},8269.5360000000001,9582.7420000000002,11510.931,13682.894,1542.279,1687.444]
[{"$f":"HLOOKUP(INDICE!$F$2,Nombres!$C$3:$E$853,103)","v":"  . Loans and advances to customers"},6592.5680000000002,7685.0379999999996,8874.4220000000005,10560.779,1010.849,1161.9179999999999]
[{"$f":"HLOOKUP(INDICE!$F$2,Nombres!$C$3:$E$853,104)","v":"  . Loans and advances to credit institutions and other"},1676.9679999999998,1897.7040000000002,2636.509,3122.1150000000002,531.43000000000006,525.52600000000007]
[{"$f":"HLOOKUP(INDICE!$F$2,Nombres!$C$3:$E$853,106)","v":"Tangible assets"},211.834,253.453,273.90899999999999,374.43099999999998,31.425000000000001,36.500999999999998]
[{"$f":"HLOOKUP(INDICE!$F$2,Nombres!$C$3:$E$853,107)","v":"Other assets"},210.99,237.43192857999898,303.45652290000635,412.15605204999827,66.013000000000005,73.587999999999994]
[{"$f":"HLOOKUP(INDICE!$F$2,Nombres!$C$3:$E$853,108)","v":"Total assets / Liabilities and equity"},15035.460000000001,16321.332928579999,17512.924522900001,21987.744052049999,2442.5210000000002,2502.1280000000006]
[{"$f":"HLOOKUP(INDICE!$F$2,Nombres!$C$3:$E$853,109)","v":"Deposits from central banks and credit institutions"},128.428,105.375,194.185,372.88200000000001,36.881,8.2769999999999992]
[{"$f":"HLOOKUP(INDICE!$F$2,Nombres!$C$3:$E$853,110)","v":"Deposits from customers"},12633.431,13798.061,14645.154,18340.96,1944.454,2017.4659999999999]
[{"$f":"HLOOKUP(INDICE!$F$2,Nombres!$C$3:$E$853,111)","v":"Debt certificates"},"0","0","0","0","0","0"]
[{"$f":"HLOOKUP(INDICE!$F$2,Nombres!$C$3:$E$853,112)","v":"Subordinated liabilities"},"0","0","0","0","0","0"]
[{"$f":"HLOOKUP(INDICE!$F$2,Nombres!$C$3:$E$853,114)","v":"Financial liabilities held for trading "},2.0579999999999998,1.8820000000000001,0,0,"0","0"]
[{"$f":"HLOOKUP(INDICE!$F$2,Nombres!$C$3:$E$853,115)","v":"Other liabilities"},1579.5292499999994,1641.7696885799999,1806.49228483,2225.5146776000001,373.61679999999996,361.43967000000066]
[{"$f":"HLOOKUP(INDICE!$F$2,Nombres!$C$3:$E$853,116)","v":"Economic capital allocated"},692.01374999999996,774.24523999999997,867.09323806999998,1048.3873744499999,87.569199999999995,114.94533]
[{"$f":"HLOOKUP(INDICE!$F$2,Nombres!$C$3:$E$853,117)","v":"Relevant business indicators"}]
[{"$f":"HLOOKUP(INDICE!$F$2,Nombres!$C$3:$E$853,201)","v":"Annex:"}]
[{"$f":"HLOOKUP(INDICE!$F$2,Nombres!$C$3:$E$853,30)","v":"(Million euros)"},"2014-03-31","2014-06-30","2014-09-30","2014-12-31","2015-03-31","2015-06-30"]
[{"$f":"HLOOKUP(INDICE!$F$2,Nombres!$C$3:$E$853,118)","v":"Loans and advances to customers gross"},6812.8710000000001,7951.88,9180.7729999999992,10936.634,1041.626,1195.5609999999999]
[{"$f":"HLOOKUP(INDICE!$F$2,Nombres!$C$3:$E$853,121)","v":"Customer deposits under management (*)"},12512.234786630001,13662.68636014,14498.273905030001,18332.530347129999,1922.0015853100001,1995.8840727899999]
[{"$f":"HLOOKUP(INDICE!$F$2,Nombres!$C$3:$E$853,122)","v":"Mutual funds"},9.5200864700000007,9.7576068300000003,9.2385821099999994,9.3031853899999994,0.66369003000000004,0.61977720999999997]
[{"$f":"HLOOKUP(INDICE!$F$2,Nombres!$C$3:$E$853,206)","v":"Pension funds"},"0","0","0","0","0","0"]
[{"$f":"HLOOKUP(INDICE!$F$2,Nombres!$C$3:$E$853,284)","v":"(*) Excluding repos and including specific marketable debt securities."}]
[{"$f":"HLOOKUP(INDICE!$F$2,Nombres!$C$3:$E$853,93)","v":"Income statement  "}]
[{"$f":"HLOOKUP(INDICE!$F$2,Nombres!$C$3:$E$853,31)","v":"(Constant million euros)    "}]
[null,2014,null,null,null,2015]
[null,{"$f":"HLOOKUP(INDICE!$F$2,Nombres!$C$3:$E$857,34)","v":"1st Quarter"},{"$f":"HLOOKUP(INDICE!$F$2,Nombres!$C$3:$E$857,35)","v":"2nd Quarter"},{"$f":"HLOOKUP(INDICE!$F$2,Nombres!$C$3:$E$857,36)","v":"3rd Quarter"},{"$f":"HLOOKUP(INDICE!$F$2,Nombres!$C$3:$E$857,37)","v":"4th Quarter"},{"$f":"HLOOKUP(INDICE!$F$2,Nombres!$C$3:$E$857,34)","v":"1st Quarter"},{"$f":"HLOOKUP(INDICE!$F$2,Nombres!$C$3:$E$857,35)","v":"2nd Quarter"}]
[{"$f":"HLOOKUP(INDICE!$F$2,Nombres!$C$3:$E$853,38)","v":"Net interest income"},20.543269290399998,28.5380947126,34.111698871000002,45.677356669999995,36.6415584975,57.267442182599993]
[{"$f":"HLOOKUP(INDICE!$F$2,Nombres!$C$3:$E$853,39)","v":"Net fees and commissions"},2.5914546073000002,4.3136293626000004,5.5886535597,7.8017131905000001,5.7986250329000004,8.6453726169999996]
[{"$f":"HLOOKUP(INDICE!$F$2,Nombres!$C$3:$E$853,40)","v":"Net trading income"},4.9522140337000007,0.43076358910000007,1.3015214971000002,0.7233154100000001,67.635894652600001,21.897051287499998]
[{"$f":"HLOOKUP(INDICE!$F$2,Nombres!$C$3:$E$853,95)","v":"Other income/expenses"},-8.2711409584000002,-16.803225092599998,-16.407173282400002,-23.765229128000001,-21.860988373799998,-48.549013056099994]
[{"$f":"HLOOKUP(INDICE!$F$2,Nombres!$C$3:$E$853,44)","v":"Gross income"},19.815796973000001,16.4792625718,24.5947006454,30.437156142599999,88.215089809099993,39.2608530308]
[{"$f":"HLOOKUP(INDICE!$F$2,Nombres!$C$3:$E$853,45)","v":"Operating expenses"},-6.5564223968999995,-8.8876330056999997,-10.7022802958,-16.245040745400001,-13.842977600800001,-19.6300191192]
[{"$f":"HLOOKUP(INDICE!$F$2,Nombres!$C$3:$E$853,46)","v":"  Administration expenses"},-5.7456992750999998,-7.7814556671000004,-9.3858078714000008,-13.2345838562,-12.113544689199999,-17.175453150799999]
[{"$f":"HLOOKUP(INDICE!$F$2,Nombres!$C$3:$E$853,47)","v":"  Personnel expenses"},-2.5515106701999999,-3.4891523448999999,-3.9015656642000001,-5.5728839276999995,-5.1027146870999998,-7.1532855929000005]
[{"$f":"HLOOKUP(INDICE!$F$2,Nombres!$C$3:$E$853,48)","v":"  General and administrative expenses"},-3.1941886048999999,-4.2923033221999995,-5.4842422071999994,-7.6616999286,-7.0108300021000005,-10.0221675579]
[{"$f":"HLOOKUP(INDICE!$F$2,Nombres!$C$3:$E$853,49)","v":"  Depreciation and amortization"},-0.81072312169999994,-1.1061773387,-1.3164724243999999,-3.0104568890999994,-1.7294329116,-2.4545659683999999]
[{"$f":"HLOOKUP(INDICE!$F$2,Nombres!$C$3:$E$853,50)","v":"Operating income"},13.259374576199999,7.5916295659999999,13.8924203495,14.1921153972,74.372112208299995,19.630833911700002]
[{"$f":"HLOOKUP(INDICE!$F$2,Nombres!$C$3:$E$853,51)","v":"Impairment on financial assets (net)"},-1.4851459946999999,-3.2622255760000001,-4.6528081717000003,-5.9613578163999996,-3.1964855242999999,-6.5785147256999998]
[{"$f":"HLOOKUP(INDICE!$F$2,Nombres!$C$3:$E$853,160)","v":"Provisions (net) and other gains/losses"},-1.1660845262999999,-1.2183074288,-1.789905015,-2.8524717473000001,-27.003200494799998,-3.5667993950999994]
[{"$f":"HLOOKUP(INDICE!$F$2,Nombres!$C$3:$E$853,54)","v":"Income before tax"},10.6081440551,3.1110965613000001,7.4497071628000011,5.3782858333999997,44.172426189300005,9.4855197906999997]
[{"$f":"HLOOKUP(INDICE!$F$2,Nombres!$C$3:$E$853,55)","v":"Income tax"},-3.4398829794000001,-1.4291747608000001,-1.5417114033999999,-0.46769859690000004,-19.635013717200003,-17.6149680527]
[{"$f":"HLOOKUP(INDICE!$F$2,Nombres!$C$3:$E$853,56)","v":"Net income"},7.1682610758000003,1.6819218005000001,5.9079957593000003,4.9105872365999996,24.537412472,-8.1294482621000004]
[{"$f":"HLOOKUP(INDICE!$F$2,Nombres!$C$3:$E$853,57)","v":"Non-controlling interests"},-3.2062404889999998,-0.73128325449999998,-2.6504967495000002,-2.2037998382000001,-10.822343977600001,3.6133599776000001]
[{"$f":"HLOOKUP(INDICE!$F$2,Nombres!$C$3:$E$853,58)","v":"Net attributable profit"},3.9620205867000005,0.95063854589999996,3.2574990097000001,2.7067873984999999,13.715068494500001,-4.5160882844000003]
[]
[{"$f":"HLOOKUP(INDICE!$F$2,Nombres!$C$3:$E$853,94)","v":"Balance sheet  "}]
[{"$f":"HLOOKUP(INDICE!$F$2,Nombres!$C$3:$E$853,31)","v":"(Constant million euros)    "}]
[null,"2014-03-31","2014-06-30","2014-09-30","2014-12-31","2015-03-31","2015-06-30"]
[{"$f":"HLOOKUP(INDICE!$F$2,Nombres!$C$3:$E$853,100)","v":"Cash and balances with central banks"},305.80707931310002,294.07775208840002,254.78426744379999,380.28854351820002,516.67203238529999,440.28500000000003]
[{"$f":"HLOOKUP(INDICE!$F$2,Nombres!$C$3:$E$853,101)","v":"Financial assets"},118.1143600071,115.66423363689999,116.2662835399,115.9049847024,238.30038198049999,264.31]
[{"$f":"HLOOKUP(INDICE!$F$2,Nombres!$C$3:$E$853,102)","v":"Loans and receivables"},552.66882181109997,628.46294876440004,787.36040330979995,903.04947434370001,1450.3890118331001,1687.444]
[{"$f":"HLOOKUP(INDICE!$F$2,Nombres!$C$3:$E$853,103)","v":"  . Loans and advances to customers"},440.59386031690002,504.00622732469998,607.02027360440002,696.99479690550004,950.62195765000001,1161.9179999999999]
[{"$f":"HLOOKUP(INDICE!$F$2,Nombres!$C$3:$E$853,104)","v":"  . Loans and advances to credit institutions and other"},112.0749614942,124.45672143960002,180.34012970540002,206.0546774382,499.76705418309996,525.52600000000007]
[{"$f":"HLOOKUP(INDICE!$F$2,Nombres!$C$3:$E$853,106)","v":"Tangible assets"},14.157269186500001,16.622154676899999,18.735678348699999,24.711856843100001,29.552678015400001,36.500999999999998]
[{"$f":"HLOOKUP(INDICE!$F$2,Nombres!$C$3:$E$853,107)","v":"Other assets"},14.100863061,15.571448126799774,20.756761573599999,27.201650919200087,62.079902428899999,73.587999999999994]
[{"$f":"HLOOKUP(INDICE!$F$2,Nombres!$C$3:$E$853,108)","v":"Total assets / Liabilities and equity"},1004.8483933786,1070.3985372934001,1197.9033942158999,1451.1565103265,2296.9940066432005,2502.1280000000006]
[{"$f":"HLOOKUP(INDICE!$F$2,Nombres!$C$3:$E$853,109)","v":"Deposits from central banks and credit institutions"},8.5830875453999997,6.9107864144000004,13.2824686306,24.609625280500001,34.683605978800003,8.2769999999999992]
[{"$f":"HLOOKUP(INDICE!$F$2,Nombres!$C$3:$E$853,110)","v":"Deposits from customers"},844.31622598920001,904.91532624900003,1001.7447207332,1210.4745010053,1828.6021631721001,2017.4659999999999]
[{"$f":"HLOOKUP(INDICE!$F$2,Nombres!$C$3:$E$853,111)","v":"Debt certificates"},"0","0","0","0","0","0"]
[{"$f":"HLOOKUP(INDICE!$F$2,Nombres!$C$3:$E$853,112)","v":"Subordinated liabilities"},"0","0","0","0","0","0"]
[{"$f":"HLOOKUP(INDICE!$F$2,Nombres!$C$3:$E$853,114)","v":"Financial liabilities held for trading "},0.13754005489999999,0.1234268093,0,0,"0","0"]
[{"$f":"HLOOKUP(INDICE!$F$2,Nombres!$C$3:$E$853,115)","v":"Other liabilities"},105.5629444763,107.6718354389,123.5660689793,146.8804669356,351.35646751100057,361.43967000000066]
[{"$f":"HLOOKUP(INDICE!$F$2,Nombres!$C$3:$E$853,116)","v":"Economic capital allocated"},46.248595312900001,50.777162381799997,59.310135872899998,69.191917105100003,82.351769981299995,114.94533]
[{"$f":"HLOOKUP(INDICE!$F$2,Nombres!$C$3:$E$853,117)","v":"Relevant business indicators"}]
[{"$f":"HLOOKUP(INDICE!$F$2,Nombres!$C$3:$E$853,201)","v":"Annex:"}]
[{"$f":"HLOOKUP(INDICE!$F$2,Nombres!$C$3:$E$853,31)","v":"(Constant million euros)    "}]
[null,"2014-03-31","2014-06-30","2014-09-30","2014-12-31","2015-03-31","2015-06-30"]
[{"$f":"HLOOKUP(INDICE!$F$2,Nombres!$C$3:$E$853,118)","v":"Loans and advances to customers gross"},455.31712888379997,521.50646996659998,627.97502061090006,721.80063550799991,979.5652439278,1195.5609999999999]
[{"$f":"HLOOKUP(INDICE!$F$2,Nombres!$C$3:$E$853,121)","v":"Customer deposits under management (*)"},836.21645250120002,896.03707977700003,991.69795989229999,1209.9181571797001,1807.4874779851,1995.8840727899999]
[{"$f":"HLOOKUP(INDICE!$F$2,Nombres!$C$3:$E$853,122)","v":"Mutual funds"},0.63624548859999996,0.6399310721,0.63192922760000003,0.61399559739999998,0.62414694540000004,0.61977720999999997]
[{"$f":"HLOOKUP(INDICE!$F$2,Nombres!$C$3:$E$853,206)","v":"Pension funds"},"0","0","0","0","0","0"]
[{"$f":"HLOOKUP(INDICE!$F$2,Nombres!$C$3:$E$853,284)","v":"(*) Excluding repos and including specific marketable debt securities."}]

{"sheet":"AdS_sinVenezuela","index":15,"n_rows":99,"n_cols":7,"rows_kept":99,"cut":false,"hidden":false,"merged":[[3,1,3,4],[3,5,3,6],[51,1,51,4],[51,5,51,6]]}
[{"$f":"HLOOKUP(INDICE!$F$2,Nombres!$C$3:$E$853,305)","v":"South America without Venezuela"}]
[{"$f":"HLOOKUP(INDICE!$F$2,Nombres!$C$3:$E$853,93)","v":"Income statement  "}]
[{"$f":"HLOOKUP(INDICE!$F$2,Nombres!$C$3:$E$853,30)","v":"(Million euros)"}]
[null,2014,null,null,null,2015]
[null,{"$f":"HLOOKUP(INDICE!$F$2,Nombres!$C$3:$E$857,34)","v":"1st Quarter"},{"$f":"HLOOKUP(INDICE!$F$2,Nombres!$C$3:$E$857,35)","v":"2nd Quarter"},{"$f":"HLOOKUP(INDICE!$F$2,Nombres!$C$3:$E$857,36)","v":"3rd Quarter"},{"$f":"HLOOKUP(INDICE!$F$2,Nombres!$C$3:$E$857,37)","v":"4th Quarter"},{"$f":"HLOOKUP(INDICE!$F$2,Nombres!$C$3:$E$857,34)","v":"1st Quarter"},{"$f":"HLOOKUP(INDICE!$F$2,Nombres!$C$3:$E$857,35)","v":"2nd Quarter"}]
[{"$f":"HLOOKUP(INDICE!$F$2,Nombres!$C$3:$E$853,38)","v":"Net interest income"},640.59538595999993,679.61512201000005,695.27436951000004,758.04256295999994,762.99996190000002,795.42969249000009]
[{"$f":"HLOOKUP(INDICE!$F$2,Nombres!$C$3:$E$853,39)","v":"Net fees and commissions"},135.7903958,151.13242195000001,155.40525467999998,155.83148891000002,168.15800659000001,177.50897764999999]
[{"$f":"HLOOKUP(INDICE!$F$2,Nombres!$C$3:$E$853,40)","v":"Net trading income"},81.732012919999988,82.735675950000001,113.88573879999998,93.047887220000007,108.22744240999999,108.44917846]
[{"$f":"HLOOKUP(INDICE!$F$2,Nombres!$C$3:$E$853,95)","v":"Other income/expenses"},19.132997250000003,23.759001560000002,23.356999309999999,17.943999950000002,25.742001109999997,22.62999881]
[{"$f":"HLOOKUP(INDICE!$F$2,Nombres!$C$3:$E$853,44)","v":"Gross income"},877.25079192999999,937.24222147,987.92236230000003,1024.8659390399998,1065.1274120099999,1104.0178474100001]
[{"$f":"HLOOKUP(INDICE!$F$2,Nombres!$C$3:$E$853,45)","v":"Operating expenses"},-401.81282236999994,-410.54700925999998,-428.30721183000003,-442.47353019000002,-489.08813277999997,-491.41576714999997]
[{"$f":"HLOOKUP(INDICE!$F$2,Nombres!$C$3:$E$853,46)","v":"  Administration expenses"},-379.40989898999999,-388.91149307000001,-404.71414469000001,-423.89882362999998,-464.07847691000001,-467.56730381999995]
[{"$f":"HLOOKUP(INDICE!$F$2,Nombres!$C$3:$E$853,47)","v":"  Personnel expenses"},-210.06325980999998,-215.26610542000003,-217.80783332999999,-224.05134956999999,-260.86386886999998,-253.63039587999998]
[{"$f":"HLOOKUP(INDICE!$F$2,Nombres!$C$3:$E$853,48)","v":"  General and administrative expenses"},-169.34663918000001,-173.64538765,-186.90631136000002,-199.84747406000002,-203.21460804,-213.93690793999997]
[{"$f":"HLOOKUP(INDICE!$F$2,Nombres!$C$3:$E$853,49)","v":"  Depreciation and amortization"},-22.402923380000001,-21.635516190000001,-23.593067140000002,-18.574706560000003,-25.00965587,-23.848463330000001]
[{"$f":"HLOOKUP(INDICE!$F$2,Nombres!$C$3:$E$853,50)","v":"Operating income"},475.43796956,526.69521221000002,559.61515047,582.39240885000004,576.03927923000003,612.60208025999998]
[{"$f":"HLOOKUP(INDICE!$F$2,Nombres!$C$3:$E$853,51)","v":"Impairment on financial assets (net)"},-115.31499918,-119.16800132999998,-129.64799798000001,-112.41300249000001,-133.28800061000001,-166.88599962000001]
[{"$f":"HLOOKUP(INDICE!$F$2,Nombres!$C$3:$E$853,160)","v":"Provisions (net) and other gains/losses"},-10.025999169999999,-8.397000310000001,-23.787000300000003,-71.344997589999991,-21.66600051,6.7929969399999992]
[{"$f":"HLOOKUP(INDICE!$F$2,Nombres!$C$3:$E$853,54)","v":"Income before tax"},350.09697120999999,399.13021057000003,406.18015218999994,398.63440876999999,421.08527810999999,452.50907757999994]
[{"$f":"HLOOKUP(INDICE!$F$2,Nombres!$C$3:$E$853,55)","v":"Income tax"},-92.559157220000003,-97.813093760000001,-89.178639939999996,-107.69042345000001,-123.77642227999999,-110.88325209999999]
[{"$f":"HLOOKUP(INDICE!$F$2,Nombres!$C$3:$E$853,56)","v":"Net income"},257.53781399000002,301.31711681000002,317.00151225000002,290.94398532000002,297.30885582999997,341.62582548]
[{"$f":"HLOOKUP(INDICE!$F$2,Nombres!$C$3:$E$853,57)","v":"Non-controlling interests"},-70.935872570000001,-81.224656449999998,-92.812136650000014,-83.362259899999998,-84.588413250000002,-89.160388560000001]
[{"$f":"HLOOKUP(INDICE!$F$2,Nombres!$C$3:$E$853,58)","v":"Net attributable profit"},186.60194142,220.09246035999999,224.18937560000001,207.58172542,212.72044258,252.46543692]
[{"$f":"HLOOKUP(INDICE!$F$2,Nombres!$C$3:$E$853,94)","v":"Balance sheet  "}]
[{"$f":"HLOOKUP(INDICE!$F$2,Nombres!$C$3:$E$853,30)","v":"(Million euros)"}]
[null,"2014-03-31","2014-06-30","2014-09-30","2014-12-31","2015-03-31","2015-06-30"]
[{"$f":"HLOOKUP(INDICE!$F$2,Nombres!$C$3:$E$853,100)","v":"Cash and balances with central banks"},6500.732,6159.8630000000003,6992.8869999999997,7760.63,9237.0229999999992,9282.1869999999999]
[{"$f":"HLOOKUP(INDICE!$F$2,Nombres!$C$3:$E$853,101)","v":"Financial assets"},7524.7250000000004,7422.1850000000004,8205.6110000000008,8914.4719999999998,10274.481,9472.1869999999999]
[{"$f":"HLOOKUP(INDICE!$F$2,Nombres!$C$3:$E$853,102)","v":"Loans and receivables"},38955.658265120001,41202.814705199999,43556.228403369998,43529.37347929,48884.88732627,47825.721076089998]
[{"$f":"HLOOKUP(INDICE!$F$2,Nombres!$C$3:$E$853,103)","v":"  . Loans and advances to customers"},36107.741265119999,38449.5007052,40345.801403370002,40741.704479289998,44788.931326270002,43856.425076090003]
[{"$f":"HLOOKUP(INDICE!$F$2,Nombres!$C$3:$E$853,104)","v":"  . Loans and advances to credit institutions and other"},2847.9170000000004,2753.3139999999999,3210.4270000000001,2787.6689999999999,4095.9560000000001,3969.2959999999998]
[{"$f":"HLOOKUP(INDICE!$F$2,Nombres!$C$3:$E$853,106)","v":"Tangible assets"},583.46600000000001,603.971,643.78700000000003,688.00800000000004,776.83900000000006,730.87400000000002]
[{"$f":"HLOOKUP(INDICE!$F$2,Nombres!$C$3:$E$853,107)","v":"Other assets"},1367.9570000000001,1325.355,1709.3019999999999,1484.921,1913.231,1627.6610000000001]
[{"$f":"HLOOKUP(INDICE!$F$2,Nombres!$C$3:$E$853,108)","v":"Total assets / Liabilities and equity"},54932.538265119998,56714.188705200002,61107.815403369998,62377.404479289995,71086.46132627,68938.63007608999]
[{"$f":"HLOOKUP(INDICE!$F$2,Nombres!$C$3:$E$853,109)","v":"Deposits from central banks and credit institutions"},4288.4920000000002,4255.232,4984.1279999999997,5397.28,7037.7359999999999,6399.0709999999999]
[{"$f":"HLOOKUP(INDICE!$F$2,Nombres!$C$3:$E$853,110)","v":"Deposits from customers"},35425.031000000003,36544.713000000003,37450.915000000001,38028.938000000002,42110.754000000001,41320.053999999996]
[{"$f":"HLOOKUP(INDICE!$F$2,Nombres!$C$3:$E$853,111)","v":"Debt certificates"},3783.181,4266.3980000000001,4656.8329999999996,4676.7370000000001,5314.7269999999999,5119.1760000000004]
[{"$f":"HLOOKUP(INDICE!$F$2,Nombres!$C$3:$E$853,112)","v":"Subordinated liabilities"},1243.00833878,1262.39333878,1540.7953384899999,1658.23633849,1813.877,2056.328]
[{"$f":"HLOOKUP(INDICE!$F$2,Nombres!$C$3:$E$853,114)","v":"Financial liabilities held for trading "},1356.4179999999999,1376.1690000000001,2405.1080000000002,2647.652,3659.2510000000002,3444.7620000000002]
[{"$f":"HLOOKUP(INDICE!$F$2,Nombres!$C$3:$E$853,115)","v":"Other liabilities"},6621.7139363400029,6704.4581764199984,7743.0415725999947,7609.0979143099894,8594.0143462699925,8120.4909160899952]
[{"$f":"HLOOKUP(INDICE!$F$2,Nombres!$C$3:$E$853,116)","v":"Economic capital allocated"},2214.6939900000002,2304.82519,2326.99449228,2359.4632264900001,2556.1019799999999,2478.7481600000001]
[{"$f":"HLOOKUP(INDICE!$F$2,Nombres!$C$3:$E$853,117)","v":"Relevant business indicators"}]
[{"$f":"HLOOKUP(INDICE!$F$2,Nombres!$C$3:$E$853,201)","v":"Annex:"}]
[{"$f":"HLOOKUP(INDICE!$F$2,Nombres!$C$3:$E$853,30)","v":"(Million euros)"},"2014-03-31","2014-06-30","2014-09-30","2014-12-31","2015-03-31","2015-06-30"]
[{"$f":"HLOOKUP(INDICE!$F$2,Nombres!$C$3:$E$853,118)","v":"Loans and advances to customers gross"},37263.899265119995,39657.0197052,41624.570403370002,41983.150479290001,46170.676326270004,45207.472076090002]
[{"$f":"HLOOKUP(INDICE!$F$2,Nombres!$C$3:$E$853,121)","v":"Customer deposits under management (*)"},35431.981850960001,36298.976480800004,37579.756353210003,38287.088357280001,42312.558410199999,41288.478703549998]
[{"$f":"HLOOKUP(INDICE!$F$2,Nombres!$C$3:$E$853,122)","v":"Mutual funds"},3210.2622511999998,3161.0740417799998,3725.6479875499999,3838.2552492599998,4399.1454865599999,4327.0486149199996]
[{"$f":"HLOOKUP(INDICE!$F$2,Nombres!$C$3:$E$853,206)","v":"Pension funds"},3656.4477285299999,3828.2085989000002,4285.0318874900004,4631.6069399400003,5410.9752847899999,5381.2153253200004]
[{"$f":"HLOOKUP(INDICE!$F$2,Nombres!$C$3:$E$853,284)","v":"(*) Excluding repos and including specific marketable debt securities."}]
[{"$f":"HLOOKUP(INDICE!$F$2,Nombres!$C$3:$E$853,93)","v":"Income statement  "}]
[{"$f":"HLOOKUP(INDICE!$F$2,Nombres!$C$3:$E$853,31)","v":"(Constant million euros)    "}]
[null,2014,null,null,null,2015]
[null,{"$f":"HLOOKUP(INDICE!$F$2,Nombres!$C$3:$E$857,34)","v":"1st Quarter"},{"$f":"HLOOKUP(INDICE!$F$2,Nombres!$C$3:$E$857,35)","v":"2nd Quarter"},{"$f":"HLOOKUP(INDICE!$F$2,Nombres!$C$3:$E$857,36)","v":"3rd Quarter"},{"$f":"HLOOKUP(INDICE!$F$2,Nombres!$C$3:$E$857,37)","v":"4th Quarter"},{"$f":"HLOOKUP(INDICE!$F$2,Nombres!$C$3:$E$857,34)","v":"1st Quarter"},{"$f":"HLOOKUP(INDICE!$F$2,Nombres!$C$3:$E$857,35)","v":"2nd Quarter"}]
[{"$f":"HLOOKUP(INDICE!$F$2,Nombres!$C$3:$E$853,38)","v":"Net interest income"},679.27402762580004,721.17895773329997,725.05186049380006,793.88128556520007,762.26089493070003,796.16875945929996]
[{"$f":"HLOOKUP(INDICE!$F$2,Nombres!$C$3:$E$853,39)","v":"Net fees and commissions"},145.83467215000002,164.37260530809999,166.51684172170002,165.24466700329998,167.7332436275,177.93374061259999]
[{"$f":"HLOOKUP(INDICE!$F$2,Nombres!$C$3:$E$853,40)","v":"Net trading income"},87.35885805769999,89.788957659499999,122.18154043589999,97.619017712100003,108.2898690171,108.38675185299999]
[{"$f":"HLOOKUP(INDICE!$F$2,Nombres!$C$3:$E$853,95)","v":"Other income/expenses"},19.674518866900002,25.8732970985,25.103840704100001,19.071024307100004,25.804101359599997,22.567898560300002]
[{"$f":"HLOOKUP(INDICE!$F$2,Nombres!$C$3:$E$853,44)","v":"Gross income"},932.14207670040003,1001.2138177997001,1038.8540833555999,1075.815994588,1064.0881089347999,1105.0571504852001]
[{"$f":"HLOOKUP(INDICE!$F$2,Nombres!$C$3:$E$853,45)","v":"Operating expenses"},-426.61496799450003,-439.90322680240001,-451.49636812230005,-464.2616187246,-488.43082538629994,-492.07307454369999]
[{"$f":"HLOOKUP(INDICE!$F$2,Nombres!$C$3:$E$853,46)","v":"  Administration expenses"},-402.87237010449996,-417.07042668050002,-427.08075392060005,-444.43235554260002,-463.50427876979995,-468.1415019602]
[{"$f":"HLOOKUP(INDICE!$F$2,Nombres!$C$3:$E$853,47)","v":"  Personnel expenses"},-223.38841340619999,-231.45445153259999,-230.38812845360002,-235.90255226019997,-260.38914466900002,-254.105120081]
[{"$f":"HLOOKUP(INDICE!$F$2,Nombres!$C$3:$E$853,48)","v":"  General and administrative expenses"},-179.48395669820002,-185.61597514799999,-196.69262546709999,-208.52980328230001,-203.11513410089998,-214.03638187920001]
[{"$f":"HLOOKUP(INDICE!$F$2,Nombres!$C$3:$E$853,49)","v":"  Depreciation and amortization"},-23.742597890100001,-22.832800121999998,-24.415614201700002,-19.8292631821,-24.9265466164,-23.931572583499999]
[{"$f":"HLOOKUP(INDICE!$F$2,Nombres!$C$3:$E$853,50)","v":"Operating income"},505.52710870589999,561.31059099720005,587.35771523309995,611.55437586330004,575.65728354859993,612.98407594150001]
[{"$f":"HLOOKUP(INDICE!$F$2,Nombres!$C$3:$E$853,51)","v":"Impairment on financial assets (net)"},-122.5203314524,-125.63296771169999,-133.91223825290001,-116.68389786079999,-133.56318202750001,-166.61081820250001]
[{"$f":"HLOOKUP(INDICE!$F$2,Nombres!$C$3:$E$853,160)","v":"Provisions (net) and other gains/losses"},-10.781151099800001,-9.6958181235000005,-26.440754736200002,-77.30778767679999,-21.598052114800002,6.7250485446999981]
[{"$f":"HLOOKUP(INDICE!$F$2,Nombres!$C$3:$E$853,54)","v":"Income before tax"},372.22562615369998,425.98180516209999,427.00472224420002,417.56269032559999,420.49604940620003,453.0983062839]
[{"$f":"HLOOKUP(INDICE!$F$2,Nombres!$C$3:$E$853,55)","v":"Income tax"},-97.782705639100001,-104.1816794226,-92.209492727599994,-112.88796022439999,-123.54712187220001,-111.11255250779999]
[{"$f":"HLOOKUP(INDICE!$F$2,Nombres!$C$3:$E$853,56)","v":"Net income"},274.44292051459996,321.80012573930003,334.7952295165,304.6747301012,296.94892753400001,341.98575377600002]
[{"$f":"HLOOKUP(INDICE!$F$2,Nombres!$C$3:$E$853,57)","v":"Non-controlling interests"},-77.575428537400001,-89.475110395200005,-100.98308591680001,-88.7406272586,-84.453433106099993,-89.295368703799994]
[{"$f":"HLOOKUP(INDICE!$F$2,Nombres!$C$3:$E$853,58)","v":"Net attributable profit"},196.86749197730001,232.32501534420001,233.81214359979998,215.93410284250001,212.4954944278,252.69038507220003]
[]
[{"$f":"HLOOKUP(INDICE!$F$2,Nombres!$C$3:$E$853,94)","v":"Balance sheet  "}]
[{"$f":"HLOOKUP(INDICE!$F$2,Nombres!$C$3:$E$853,31)","v":"(Constant million euros)    "}]
[null,"2014-03-31","2014-06-30","2014-09-30","2014-12-31","2015-03-31","2015-06-30"]
[{"$f":"HLOOKUP(INDICE!$F$2,Nombres!$C$3:$E$853,100)","v":"Cash and balances with central banks"},6842.2958169692001,6388.2354634199,7053.6388269783001,7855.8630346149002,8665.2894410342997,9282.1869999999999]
[{"$f":"HLOOKUP(INDICE!$F$2,Nombres!$C$3:$E$853,101)","v":"Financial assets"},7622.8882873816001,7408.0713190064998,8173.4277329211,9069.0233966018004,9797.1030783948008,9472.1869999999999]
[{"$f":"HLOOKUP(INDICE!$F$2,Nombres!$C$3:$E$853,102)","v":"Loans and receivables"},40534.836912721003,41964.306251008697,43558.036970586603,44322.848326308798,46129.109500157698,47825.721076089998]
[{"$f":"HLOOKUP(INDICE!$F$2,Nombres!$C$3:$E$853,103)","v":"  . Loans and advances to customers"},37526.524231574702,39062.600841916501,40213.4883917138,41470.120823204401,42269.925137505103,43856.425076090003]
[{"$f":"HLOOKUP(INDICE!$F$2,Nombres!$C$3:$E$853,104)","v":"  . Loans and advances to credit institutions and other"},3008.3126811463003,2901.7054090922002,3344.5485788729002,2852.7275031044001,3859.1843626526002,3969.2959999999998]
[{"$f":"HLOOKUP(INDICE!$F$2,Nombres!$C$3:$E$853,106)","v":"Tangible assets"},614.31413652469996,626.84087122669996,649.6633337472,699.76476324769999,730.34694872130001,730.87400000000002]
[{"$f":"HLOOKUP(INDICE!$F$2,Nombres!$C$3:$E$853,107)","v":"Other assets"},1440.0515261263999,1361.8062133522999,1737.8802605766,1517.2707461284001,1808.2363803810999,1627.6610000000001]
[{"$f":"HLOOKUP(INDICE!$F$2,Nombres!$C$3:$E$853,108)","v":"Total assets / Liabilities and equity"},57054.386679722906,57749.260118014092,61172.647124809897,63464.7702669016,67130.085348689201,68938.63007608999]
[{"$f":"HLOOKUP(INDICE!$F$2,Nombres!$C$3:$E$853,109)","v":"Deposits from central banks and credit institutions"},4568.4943743695003,4462.2771245764998,5136.8235978772,5510.5508423157999,6639.8652709446997,6399.0709999999999]
[{"$f":"HLOOKUP(INDICE!$F$2,Nombres!$C$3:$E$853,110)","v":"Deposits from customers"},36531.3076094922,36877.324688353401,37058.265685298298,38599.166647722297,39687.101754832001,41320.053999999996]
[{"$f":"HLOOKUP(INDICE!$F$2,Nombres!$C$3:$E$853,111)","v":"Debt certificates"},4042.6121357840998,4497.7988006567002,4841.4225184452998,4804.50953785,5018.5374163747001,5119.1760000000004]
[{"$f":"HLOOKUP(INDICE!$F$2,Nombres!$C$3:$E$853,112)","v":"Subordinated liabilities"},1290.8880873296,1284.0989067367,1552.9313324304001,1683.6577608693999,1714.2435648639,2056.328]
[{"$f":"HLOOKUP(INDICE!$F$2,Nombres!$C$3:$E$853,114)","v":"Financial liabilities held for trading "},1439.2804217093999,1438.6674843005001,2458.8874051489001,2721.0709897597999,3481.6471698475998,3444.7620000000002]
[{"$f":"HLOOKUP(INDICE!$F$2,Nombres!$C$3:$E$853,115)","v":"Other liabilities"},6950.9076400745007,6923.671335961988,7881.0858332242988,7786.2796218484027,8175.3533593646998,8120.4909160899952]
[{"$f":"HLOOKUP(INDICE!$F$2,Nombres!$C$3:$E$853,116)","v":"Economic capital allocated"},2230.8964109635999,2265.4217774283002,2243.2307523854001,2359.5348665359002,2413.3368124615999,2478.7481600000001]
[{"$f":"HLOOKUP(INDICE!$F$2,Nombres!$C$3:$E$853,117)","v":"Relevant business indicators"}]
[{"$f":"HLOOKUP(INDICE!$F$2,Nombres!$C$3:$E$853,201)","v":"Annex:"}]
[{"$f":"HLOOKUP(INDICE!$F$2,Nombres!$C$3:$E$853,31)","v":"(Constant million euros)    "}]
[null,"2014-03-31","2014-06-30","2014-09-30","2014-12-31","2015-03-31","2015-06-30"]
[{"$f":"HLOOKUP(INDICE!$F$2,Nombres!$C$3:$E$853,118)","v":"Loans and advances to customers gross"},38730.003341751304,40290.865259118,41482.242361189703,42731.552476019402,43573.253432306199,45207.472076090002]
[{"$f":"HLOOKUP(INDICE!$F$2,Nombres!$C$3:$E$853,121)","v":"Customer deposits under management (*)"},36528.272818810197,36608.153293040799,37181.916539441503,38867.261799070999,39885.606646795299,41288.478703549998]
[{"$f":"HLOOKUP(INDICE!$F$2,Nombres!$C$3:$E$853,122)","v":"Mutual funds"},3367.1819378752998,3260.0340934361002,3774.4197019908001,3925.9315918038001,4154.6847601244999,4327.0486149199996]
[{"$f":"HLOOKUP(INDICE!$F$2,Nombres!$C$3:$E$853,206)","v":"Pension funds"},4505.7717085752001,4672.9522261002003,4818.8585378447997,5025.6498431593,5202.9985529551996,5381.2153253200004]
[{"$f":"HLOOKUP(INDICE!$F$2,Nombres!$C$3:$E$853,284)","v":"(*) Excluding repos and including specific marketable debt securities."}]

{"sheet":"Resto de Eurasia","index":16,"n_rows":52,"n_cols":7,"rows_kept":52,"cut":false,"hidden":false,"merged":[[3,1,3,4],[3,5,3,6]]}
[{"$f":"HLOOKUP(INDICE!$F$2,Nombres!$C$3:$E$853,184)","v":"Rest of Eurasia"}]
[{"$f":"HLOOKUP(INDICE!$F$2,Nombres!$C$3:$E$853,93)","v":"Income statement  "}]
[{"$f":"HLOOKUP(INDICE!$F$2,Nombres!$C$3:$E$853,30)","v":"(Million euros)"}]
[null,2014,null,null,null,2015]
[null,{"$f":"HLOOKUP(INDICE!$F$2,Nombres!$C$3:$E$857,34)","v":"1st Quarter"},{"$f":"HLOOKUP(INDICE!$F$2,Nombres!$C$3:$E$857,35)","v":"2nd Quarter"},{"$f":"HLOOKUP(INDICE!$F$2,Nombres!$C$3:$E$857,36)","v":"3rd Quarter"},{"$f":"HLOOKUP(INDICE!$F$2,Nombres!$C$3:$E$857,37)","v":"4th Quarter"},{"$f":"HLOOKUP(INDICE!$F$2,Nombres!$C$3:$E$857,34)","v":"1st Quarter"},{"$f":"HLOOKUP(INDICE!$F$2,Nombres!$C$3:$E$857,35)","v":"2nd Quarter"}]
[{"$f":"HLOOKUP(INDICE!$F$2,Nombres!$C$3:$E$853,38)","v":"Net interest income"},47.334717870000006,47.798718519999994,49.94009346,43.789860579999996,46.316785299999992,38.986556489999998]
[{"$f":"HLOOKUP(INDICE!$F$2,Nombres!$C$3:$E$853,39)","v":"Net fees and commissions"},47.187699530000003,49.222468800000001,44.676670340000001,46.308410530000003,45.518635189999998,44.869490460000002]
[{"$f":"HLOOKUP(INDICE!$F$2,Nombres!$C$3:$E$853,40)","v":"Net trading income"},42.848322789999997,51.86429322,25.27883155,30.00676567,73.422160230000003,15.89961881]
[{"$f":"HLOOKUP(INDICE!$F$2,Nombres!$C$3:$E$853,95)","v":"Other income/expenses"},18.903060780000001,157.80692557,18.853679169999999,13.78575273,-1.4002363900000001,1.5018494499999999]
[{"$f":"HLOOKUP(INDICE!$F$2,Nombres!$C$3:$E$853,44)","v":"Gross income"},156.27380097,306.69240610999998,138.74927452,133.89078950999999,163.85734432999999,101.25751521000001]
[{"$f":"HLOOKUP(INDICE!$F$2,Nombres!$C$3:$E$853,45)","v":"Operating expenses"},-86.026502999999991,-78.67287601000001,-88.192270269999995,-89.95224709,-89.844150319999997,-86.10209205000001]
[{"$f":"HLOOKUP(INDICE!$F$2,Nombres!$C$3:$E$853,46)","v":"  Administration expenses"},-83.350057370000002,-76.019286170000001,-85.54749477,-86.208531499999992,-86.227106550000002,-82.582905729999993]
[{"$f":"HLOOKUP(INDICE!$F$2,Nombres!$C$3:$E$853,47)","v":"  Personnel expenses"},-51.125246740000001,-40.092004250000002,-47.918346659999997,-46.090227030000001,-51.424499240000003,-48.90420056]
[{"$f":"HLOOKUP(INDICE!$F$2,Nombres!$C$3:$E$853,48)","v":"  General and administrative expenses"},-32.22481063,-35.927281919999999,-37.629148110000003,-40.118304469999998,-34.802607309999999,-33.678705170000001]
[{"$f":"HLOOKUP(INDICE!$F$2,Nombres!$C$3:$E$853,49)","v":"  Depreciation and amortization"},-2.6764456299999999,-2.65358984,-2.6447754999999997,-3.7437155899999999,-3.61704377,-3.5191863200000002]
[{"$f":"HLOOKUP(INDICE!$F$2,Nombres!$C$3:$E$853,50)","v":"Operating income"},70.247297970000005,228.0195301,50.557004249999999,43.938542420000005,74.013194010000007,15.155423160000002]
[{"$f":"HLOOKUP(INDICE!$F$2,Nombres!$C$3:$E$853,51)","v":"Impairment on financial assets (net)"},-24.155984969999999,-17.74837295,-14.67261315,0.36999791999999987,-22.135366950000002,-5.629346710000001]
[{"$f":"HLOOKUP(INDICE!$F$2,Nombres!$C$3:$E$853,160)","v":"Provisions (net) and other gains/losses"},2.38625548,-6.0628539999999997,1.9376298100000002,-14.56561801,4.09722439,0.86933723000000007]
[{"$f":"HLOOKUP(INDICE!$F$2,Nombres!$C$3:$E$853,54)","v":"Income before tax"},48.477568480000002,204.20830314999998,37.822020909999999,29.742922330000003,55.975051449999995,10.395413679999997]
[{"$f":"HLOOKUP(INDICE!$F$2,Nombres!$C$3:$E$853,55)","v":"Income tax"},-11.05751298,-33.195998899999999,-10.494974409999999,-10.55334435,-19.664015389999999,-3.4608241599999996]
[{"$f":"HLOOKUP(INDICE!$F$2,Nombres!$C$3:$E$853,56)","v":"Net income"},37.420055499999997,171.01230425,27.327046500000002,19.189577980000003,36.311036059999999,6.9345895199999994]
[{"$f":"HLOOKUP(INDICE!$F$2,Nombres!$C$3:$E$853,57)","v":"Non-controlling interests"},"0","0","0","0","0","0"]
[{"$f":"HLOOKUP(INDICE!$F$2,Nombres!$C$3:$E$853,58)","v":"Net attributable profit"},37.420055499999997,171.01230425,27.327046500000002,19.189577980000003,36.311036059999999,6.9345895199999994]
[]
[{"$f":"HLOOKUP(INDICE!$F$2,Nombres!$C$3:$E$853,94)","v":"Balance sheet  "}]
[{"$f":"HLOOKUP(INDICE!$F$2,Nombres!$C$3:$E$853,30)","v":"(Million euros)"},"2014-03-31","2014-06-30","2014-09-30","2014-12-31","2015-03-31","2015-06-30"]
[{"$f":"HLOOKUP(INDICE!$F$2,Nombres!$C$3:$E$853,100)","v":"Cash and balances with central banks"},173.66701104000001,190.80105024,204.14650777,198.43595162,246.53847041,277.03916909999998]
[{"$f":"HLOOKUP(INDICE!$F$2,Nombres!$C$3:$E$853,101)","v":"Financial assets"},4228.7163247500002,4376.0487349200002,4640.7783259099997,5119.2228135799996,3474.0741522899998,3134.2226164799999]
[{"$f":"HLOOKUP(INDICE!$F$2,Nombres!$C$3:$E$853,102)","v":"Loans and receivables"},17221.83173224,17214.259615340001,17618.319712600001,16277.034306129999,17188.798881300001,15890.06619738]
[{"$f":"HLOOKUP(INDICE!$F$2,Nombres!$C$3:$E$853,103)","v":"  . Loans and advances to customers"},15949.28130884,15625.611146429999,16018.88603195,15101.06986204,16186.92075311,15070.46613422]
[{"$f":"HLOOKUP(INDICE!$F$2,Nombres!$C$3:$E$853,104)","v":"  . Loans and advances to credit institutions and other"},1272.5504234,1588.64846891,1599.43368065,1175.9644440899999,1001.87812819,819.60006315999999]
[{"$f":"HLOOKUP(INDICE!$F$2,Nombres!$C$3:$E$853,105)","v":"Inter-area positions"},0,0,0,0,0,0]
[{"$f":"HLOOKUP(INDICE!$F$2,Nombres!$C$3:$E$853,106)","v":"Tangible assets"},81.707716869999999,79.356151319999995,77.145669659999996,52.125319339999997,52.069683570000002,51.1739064]
[{"$f":"HLOOKUP(INDICE!$F$2,Nombres!$C$3:$E$853,107)","v":"Other assets"},314.38412914000003,292.90306695999999,287.66886667,677.86418545000004,621.46677348000003,599.65182230999994]
[{"$f":"HLOOKUP(INDICE!$F$2,Nombres!$C$3:$E$853,108)","v":"Total assets / Liabilities and equity"},22020.306914040004,22153.368618780001,22828.059082610001,22324.682576119994,21582.947961050006,19952.153711669998]
[{"$f":"HLOOKUP(INDICE!$F$2,Nombres!$C$3:$E$853,109)","v":"Deposits from central banks and credit institutions"},5282.1688199199998,5295.2463905799996,4775.79193476,5443.3478152400003,6069.9719653900002,5652.0154982599997]
[{"$f":"HLOOKUP(INDICE!$F$2,Nombres!$C$3:$E$853,110)","v":"Deposits from customers"},8525.4646233599997,7734.6837751800003,8766.6150230500007,11044.86847071,12968.679923829999,11809.39355726]
[{"$f":"HLOOKUP(INDICE!$F$2,Nombres!$C$3:$E$853,111)","v":"Debt certificates"},0.36899974000000002,0.36499973000000002,0.36099969999999998,0.35699967999999999,0.35299964,0.34799965999999999]
[{"$f":"HLOOKUP(INDICE!$F$2,Nombres!$C$3:$E$853,112)","v":"Subordinated liabilities"},516.21948879000001,528.59614390000002,540.42539581999995,609.49835657000006,331.40774611000001,324.90012758]
[{"$f":"HLOOKUP(INDICE!$F$2,Nombres!$C$3:$E$853,113)","v":"Inter-area positions"},5486.1743484200051,6122.5397487400005,5920.5492268800008,1274.9997365499985,309.82919311000296,444.22709628999655]
[{"$f":"HLOOKUP(INDICE!$F$2,Nombres!$C$3:$E$853,114)","v":"Financial liabilities held for trading "},190.27073052,202.41676921000001,212.47739555000001,216.52826739,114.7857125,96.711229380000006]
[{"$f":"HLOOKUP(INDICE!$F$2,Nombres!$C$3:$E$853,115)","v":"Other liabilities"},-45.719576710000034,154.17906144000003,449.08388589999998,1296.0533456000001,461.17807047000008,324.00189324000002]
[{"$f":"HLOOKUP(INDICE!$F$2,Nombres!$C$3:$E$853,116)","v":"Economic capital allocated"},2065.3594800000001,2115.3417300000001,2162.75522095,2439.02958438,1326.74235,1300.5563099999999]
[]
[{"$f":"HLOOKUP(INDICE!$F$2,Nombres!$C$3:$E$853,117)","v":"Relevant business indicators"}]
[{"$f":"HLOOKUP(INDICE!$F$2,Nombres!$C$3:$E$853,201)","v":"Annex:"}]
[{"$f":"HLOOKUP(INDICE!$F$2,Nombres!$C$3:$E$853,30)","v":"(Million euros)"},"2014-03-31","2014-06-30","2014-09-30","2014-12-31","2015-03-31","2015-06-30"]
[{"$f":"HLOOKUP(INDICE!$F$2,Nombres!$C$3:$E$853,118)","v":"Loans and advances to customers gross"},16675.910820649999,16364.43347425,16767.878606350001,15794.97996271,16867.734423950002,15742.082193990002]
[{"$f":"HLOOKUP(INDICE!$F$2,Nombres!$C$3:$E$853,121)","v":"Customer deposits under management (*)"},8424.54775634,7631.00329642,8662.7121226899999,10940.631369840001,12858.371840649999,11706.856557569999]
[{"$f":"HLOOKUP(INDICE!$F$2,Nombres!$C$3:$E$853,122)","v":"Mutual funds"},997.7474402254702,1139.0307343274783,1190.9814805263611,1204.9593938956539,1235.6012973849927,1184.7997548863716]
[{"$f":"HLOOKUP(INDICE!$F$2,Nombres!$C$3:$E$853,206)","v":"Pension funds"},289.68565188999997,307.16235942000003,323.50497138000003,314.26384271999996,365.2814697,338.21454140000003]
[{"$f":"HLOOKUP(INDICE!$F$2,Nombres!$C$3:$E$853,298)","v":"(*) Excluding repos."}]

{"sheet":"Centro Corporativo","index":17,"n_rows":52,"n_cols":7,"rows_kept":52,"cut":false,"hidden":false,"merged":[[6,1,6,4],[6,5,6,6]]}
[{"$f":"HLOOKUP(INDICE!$F$2,Nombres!$C$3:$E$853,25)","v":"Corporate Center "}]
[]
[]
[{"$f":"HLOOKUP(INDICE!$F$2,Nombres!$C$3:$E$853,93)","v":"Income statement  "}]
[{"$f":"HLOOKUP(INDICE!$F$2,Nombres!$C$3:$E$853,30)","v":"(Million euros)"}]
[]
[null,2014,null,null,null,2015]
[null,{"$f":"HLOOKUP(INDICE!$F$2,Nombres!$C$3:$E$857,34)","v":"1st Quarter"},{"$f":"HLOOKUP(INDICE!$F$2,Nombres!$C$3:$E$857,35)","v":"2nd Quarter"},{"$f":"HLOOKUP(INDICE!$F$2,Nombres!$C$3:$E$857,36)","v":"3rd Quarter"},{"$f":"HLOOKUP(INDICE!$F$2,Nombres!$C$3:$E$857,37)","v":"4th Quarter"},{"$f":"HLOOKUP(INDICE!$F$2,Nombres!$C$3:$E$857,34)","v":"1st Quarter"},{"$f":"HLOOKUP(INDICE!$F$2,Nombres!$C$3:$E$857,35)","v":"2nd Quarter"}]
[{"$f":"HLOOKUP(INDICE!$F$2,Nombres!$C$3:$E$853,38)","v":"Net interest income"},-178.53060038000001,-146.54695535000002,-171.46910521000001,-154.23129729999999,-129.24370175999999,-95.995632359999988]
[{"$f":"HLOOKUP(INDICE!$F$2,Nombres!$C$3:$E$853,39)","v":"Net fees and commissions"},-19.759840509999997,-37.701751659999999,-13.84207198,-19.896386189999998,-22.579257210000002,-42.493593430000004]
[{"$f":"HLOOKUP(INDICE!$F$2,Nombres!$C$3:$E$853,40)","v":"Net trading income"},15.5886897,-30.214924920000001,46.828281409999995,-18.022585209999995,91.220100589999987,56.621240569999998]
[{"$f":"HLOOKUP(INDICE!$F$2,Nombres!$C$3:$E$853,95)","v":"Other income/expenses"},-41.855871580000006,103.82855429000001,-10.342771859999999,101.38951544,-25.096317299999999,104.86593852999999]
[{"$f":"HLOOKUP(INDICE!$F$2,Nombres!$C$3:$E$853,44)","v":"Gross income"},-224.55762277000002,-110.63507763999999,-148.82566764000001,-90.760753260000001,-85.699175679999996,22.99795331000001]
[{"$f":"HLOOKUP(INDICE!$F$2,Nombres!$C$3:$E$853,45)","v":"Operating expenses"},-278.98027497999999,-238.15247854,-235.29783666259999,-241.84087209739999,-257.20358044,-285.05830545999999]
[{"$f":"HLOOKUP(INDICE!$F$2,Nombres!$C$3:$E$853,46)","v":"  Administration expenses"},-163.76134747999998,-122.33356688999999,-120.01620503260001,-128.9030206374,-142.73703222,-168.38087695000002]
[{"$f":"HLOOKUP(INDICE!$F$2,Nombres!$C$3:$E$853,47)","v":"  Personnel expenses"},-123.77644533,-96.117205079999991,-122.2153127,-111.96895255,-122.8090991,-142.52385165999999]
[{"$f":"HLOOKUP(INDICE!$F$2,Nombres!$C$3:$E$853,48)","v":"  General and administrative expenses"},-39.984902150000003,-26.216361809999999,2.1991076674000016,-16.9340680874,-19.927933119999999,-25.857025289999996]
[{"$f":"HLOOKUP(INDICE!$F$2,Nombres!$C$3:$E$853,49)","v":"  Depreciation and amortization"},-115.21892749999999,-115.81891164999999,-115.28163163000001,-112.93785145999999,-114.46654821999999,-116.67742851]
[{"$f":"HLOOKUP(INDICE!$F$2,Nombres!$C$3:$E$853,50)","v":"Operating income"},-503.53789774999996,-348.78755617999997,-384.12350430259994,-332.6016253574,-342.90275611999999,-262.06035215000003]
[{"$f":"HLOOKUP(INDICE!$F$2,Nombres!$C$3:$E$853,51)","v":"Impairment on financial assets (net)"},-4.083755,2.9230524000000004,8.1314938099999985,-11.416512640000001,2.1005363799999999,3.3484841699999994]
[{"$f":"HLOOKUP(INDICE!$F$2,Nombres!$C$3:$E$853,160)","v":"Provisions (net) and other gains/losses"},-51.344273149999999,-51.812159979999997,-48.187874060000006,-130.90945019,-7.8579545300000007,-44.993172470000005]
[{"$f":"HLOOKUP(INDICE!$F$2,Nombres!$C$3:$E$853,54)","v":"Income before tax"},-558.9659259,-397.67666376,-424.17988455260002,-474.92758818740003,-348.66017426999997,-303.70504045000001]
[{"$f":"HLOOKUP(INDICE!$F$2,Nombres!$C$3:$E$853,55)","v":"Income tax"},137.42534271,67.160177019999992,34.347857300000001,201.92602886,103.80614325000001,68.228851519999992]
[{"$f":"HLOOKUP(INDICE!$F$2,Nombres!$C$3:$E$853,269)","v":"Net income from ongoing operations"},-421.54058319000001,-330.51648674,-389.83202725260003,-273.0015593274,-244.85403102000001,-235.47618893000001]
[{"$f":"HLOOKUP(INDICE!$F$2,Nombres!$C$3:$E$853,270)","v":"Result from corporate operations"},0,0,0,0,582.94200000000001,144.274]
[{"$f":"HLOOKUP(INDICE!$F$2,Nombres!$C$3:$E$853,56)","v":"Net income"},-421.54058319000001,-330.51648674,-389.83202725260003,-273.0015593274,338.08796898000003,-91.202188929999991]
[{"$f":"HLOOKUP(INDICE!$F$2,Nombres!$C$3:$E$853,57)","v":"Non-controlling interests"},-3.4371464299999999,0.87788345000000001,0.64892165000000002,-0.75891909999999996,-5.0725457500000006,-11.62562544]
[{"$f":"HLOOKUP(INDICE!$F$2,Nombres!$C$3:$E$853,58)","v":"Net attributable profit"},-424.97772961999999,-329.63860328999999,-389.18310560259999,-273.76047842740002,333.01542323000001,-102.82781436999998]
[{"$f":"HLOOKUP(INDICE!$F$2,Nombres!$C$3:$E$853,296)","v":"Net attributable profit (excluding results from corporate operations)"},-424.97772961999999,-329.63860328999999,-389.18310560259999,-273.76047842740002,-249.92657677,-247.10181437]
[]
[{"$f":"HLOOKUP(INDICE!$F$2,Nombres!$C$3:$E$853,94)","v":"Balance sheet  "}]
[{"$f":"HLOOKUP(INDICE!$F$2,Nombres!$C$3:$E$853,30)","v":"(Million euros)"}]
[]
[null,"2014-03-31","2014-06-30","2014-09-30","2014-12-31","2015-03-31","2015-06-30"]
[{"$f":"HLOOKUP(INDICE!$F$2,Nombres!$C$3:$E$853,100)","v":"Cash and balances with central banks"},21.287647400000424,19.573243329999968,15.560878889999003,14.308299539996369,14.589213470000686,12.633830269995087]
[{"$f":"HLOOKUP(INDICE!$F$2,Nombres!$C$3:$E$853,101)","v":"Financial assets"},3164.2284130600165,3452.507219830004,3400.5300369900069,3194.1613666700141,3504.0437455700012,3491.3380760799919]
[{"$f":"HLOOKUP(INDICE!$F$2,Nombres!$C$3:$E$853,102)","v":"Loans and receivables"},80.580725539941341,35.713179450016469,38.998439630086068,23.981713810004294,30.237140950048342,89.617912760004401]
[{"$f":"HLOOKUP(INDICE!$F$2,Nombres!$C$3:$E$853,103)","v":"  . Loans and advances to customers"},80.580725539941341,35.711179449979682,38.994439630070701,23.982713810051791,30.237140950048342,89.613912759989034]
[{"$f":"HLOOKUP(INDICE!$F$2,Nombres!$C$3:$E$853,104)","v":"  . Loans and advances to credit institutions and other"},"-","-","-","-","-","-"]
[{"$f":"HLOOKUP(INDICE!$F$2,Nombres!$C$3:$E$853,105)","v":"Inter-area positions"},"-","-","-","-","-","-"]
[{"$f":"HLOOKUP(INDICE!$F$2,Nombres!$C$3:$E$853,106)","v":"Tangible assets"},2084.6270264900004,2097.4803506299995,2159.9725032300003,2245.2186300900003,2309.9276883200009,2775.2969609299989]
[{"$f":"HLOOKUP(INDICE!$F$2,Nombres!$C$3:$E$853,107)","v":"Other assets"},16540.284117280153,16721.340416190113,17755.20712688033,18198.653918090084,18081.781695450001,22645.217368275848]
[{"$f":"HLOOKUP(INDICE!$F$2,Nombres!$C$3:$E$853,108)","v":"Total assets / Liabilities and equity"},21891.007929770152,22326.614409430211,23370.268985620329,23676.323928200098,23939.655483760107,29014.104148315881]
[{"$f":"HLOOKUP(INDICE!$F$2,Nombres!$C$3:$E$853,109)","v":"Deposits from central banks and credit institutions"},"-","-","-","-","-","-"]
[{"$f":"HLOOKUP(INDICE!$F$2,Nombres!$C$3:$E$853,110)","v":"Deposits from customers"},"-","-","-","-","-","-"]
[{"$f":"HLOOKUP(INDICE!$F$2,Nombres!$C$3:$E$853,111)","v":"Debt certificates"},6048.6081015449017,4618.5612359864899,4874.926940949299,5875.247323211297,5339.4794575617925,5900.3280144804085]
[{"$f":"HLOOKUP(INDICE!$F$2,Nombres!$C$3:$E$853,112)","v":"Subordinated liabilities"},2965.4490099085997,4504.1601596026994,4691.2705622658013,3958.1019628445993,5197.7291840970975,4780.2359464654]
[{"$f":"HLOOKUP(INDICE!$F$2,Nombres!$C$3:$E$853,113)","v":"Inter-area positions"},-13335.367325782252,-13938.797135782392,-14383.336851380183,-14624.84750330208,-19565.157027901707,-12505.273468940584]
[{"$f":"HLOOKUP(INDICE!$F$2,Nombres!$C$3:$E$853,114)","v":"Financial liabilities held for trading "},"-","-","-","-","-",2.0000000004074536E-3]
[{"$f":"HLOOKUP(INDICE!$F$2,Nombres!$C$3:$E$853,115)","v":"Other liabilities"},4610.6767441188731,5846.1967795533974,7066.8248635152922,6800.6741172761267,7181.0542019506156,6499.0351163548303]
[{"$f":"HLOOKUP(INDICE!$F$2,Nombres!$C$3:$E$853,135)","v":"Shareholders' funds"},46165.426999999996,46226.447,46164.701000000008,47602.516999999993,49632.822998020005,49567.364999989994]
[{"$f":"HLOOKUP(INDICE!$F$2,Nombres!$C$3:$E$853,116)","v":"Economic capital allocated"},-24563.796600019996,-24929.958629929999,-25044.118529729996,-25936.273971829996,-23845.355329970003,-25227.59846003]

{"sheet":"Grupo BBVA sin V ","index":18,"n_rows":61,"n_cols":7,"rows_kept":61,"cut":false,"hidden":false,"merged":[[59,0,59,6],[60,0,60,6],[2,1,2,4],[2,5,2,6],[32,1,32,4],[32,5,32,6],[28,0,28,6],[29,0,29,6]]}
[{"$f":"HLOOKUP(INDICE!$F$2,Nombres!$C$3:$E$853,303)","v":"BBVA Group without Venezuela"}]
[{"$f":"HLOOKUP(INDICE!$F$2,Nombres!$C$3:$E$853,30)","v":"(Million euros)"}]
[null,2014,null,null,null,2015]
[null,{"$f":"HLOOKUP(INDICE!$F$2,Nombres!$C$3:$E$857,34)","v":"1st Quarter"},{"$f":"HLOOKUP(INDICE!$F$2,Nombres!$C$3:$E$857,35)","v":"2nd Quarter"},{"$f":"HLOOKUP(INDICE!$F$2,Nombres!$C$3:$E$857,36)","v":"3rd Quarter"},{"$f":"HLOOKUP(INDICE!$F$2,Nombres!$C$3:$E$857,37)","v":"4th Quarter"},{"$f":"HLOOKUP(INDICE!$F$2,Nombres!$C$3:$E$857,34)","v":"1st Quarter"},{"$f":"HLOOKUP(INDICE!$F$2,Nombres!$C$3:$E$857,35)","v":"2nd Quarter"}]
[{"$f":"HLOOKUP(INDICE!$F$2,Nombres!$C$3:$E$853,38)","v":"Net interest income"},3097.4350007200001,3200.2219997699999,3321.5990001600003,3572.0249996000002,3624.0030005999997,3802.7989987299998]
[{"$f":"HLOOKUP(INDICE!$F$2,Nombres!$C$3:$E$853,39)","v":"Net fees and commissions"},948.19599996000011,1033.99240887,1027.89817625,1051.93403999,1070.5990007099999,1131.35400164]
[{"$f":"HLOOKUP(INDICE!$F$2,Nombres!$C$3:$E$853,40)","v":"Net trading income"},679.99101506,415.28201520999994,424.98055623000005,504.07061483000007,703.35000562000005,632.17104844000005]
[{"$f":"HLOOKUP(INDICE!$F$2,Nombres!$C$3:$E$853,41)","v":"Dividends"},28.536000000000001,342.07100000000003,41.576999999999998,118.765,41.867000000000004,194.23000041999998]
[{"$f":"HLOOKUP(INDICE!$F$2,Nombres!$C$3:$E$853,42)","v":"Income by the equity method"},-13.683000000000002,16.359000000000002,31.064999999999998,3.2230000000000008,2.8900000000000006,18.099999999999998]
[{"$f":"HLOOKUP(INDICE!$F$2,Nombres!$C$3:$E$853,43)","v":"Other operating income and expenses"},27.660998890000002,44.662001050000001,9.7600012599999992,64.85699984,95.667000220000006,109.42700078999999]
[{"$f":"HLOOKUP(INDICE!$F$2,Nombres!$C$3:$E$853,44)","v":"Gross income"},4768.1360146299994,5052.5884249000001,4856.8797339000002,5314.8746542600002,5538.3760071500001,5888.0810500200005]
[{"$f":"HLOOKUP(INDICE!$F$2,Nombres!$C$3:$E$853,45)","v":"Operating expenses"},-2519.3859971299999,-2522.8050068699999,-2610.8970005299998,-2664.6319980200001,-2760.7979949,-2923.2730083799997]
[{"$f":"HLOOKUP(INDICE!$F$2,Nombres!$C$3:$E$853,46)","v":"  Administration expenses"},-2252.0739983900003,-2254.32000578,-2334.9809995300002,-2389.26500102,-2471.2819953899998,-2626.9020056999998]
[{"$f":"HLOOKUP(INDICE!$F$2,Nombres!$C$3:$E$853,47)","v":"  Personnel expenses"},-1338.49500023,-1304.3329984,-1379.43600227,-1355.3930035599999,-1454.5230002000001,-1530.8140045200003]
[{"$f":"HLOOKUP(INDICE!$F$2,Nombres!$C$3:$E$853,48)","v":"  General and administrative expenses"},-913.57899815999997,-949.98700738000002,-955.54499726000006,-1033.8719974600001,-1016.7589951900001,-1096.08800118]
[{"$f":"HLOOKUP(INDICE!$F$2,Nombres!$C$3:$E$853,49)","v":"  Depreciation and amortization"},-267.31199873999998,-268.48500108999997,-275.91600099999999,-275.36699699999997,-289.51599950999997,-296.37100268]
[{"$f":"HLOOKUP(INDICE!$F$2,Nombres!$C$3:$E$853,50)","v":"Operating income"},2248.7500175,2529.7834180299997,2245.98273337,2650.2426562400001,2777.57801225,2964.8080416399998]
[{"$f":"HLOOKUP(INDICE!$F$2,Nombres!$C$3:$E$853,51)","v":"Impairment on financial assets (net)"},-1082.1789994400001,-1022.7280008,-1072.2119994499999,-1079.6220002099999,-1116.0319998299999,-1082.4989999200002]
[{"$f":"HLOOKUP(INDICE!$F$2,Nombres!$C$3:$E$853,52)","v":"Provisions"},-127.94300002,-280.32499967000001,-174.40800037,-467.88299997999991,-200.79200040000001,-161.66699973999999]
[{"$f":"HLOOKUP(INDICE!$F$2,Nombres!$C$3:$E$853,53)","v":"Other gains (losses)"},-173.13899953000001,-189.99900081000001,-134.185,-203.73599917000001,-65.866000310000004,-123.13199965999999]
[{"$f":"HLOOKUP(INDICE!$F$2,Nombres!$C$3:$E$853,54)","v":"Income before tax"},865.48901851000005,1036.7314167499999,865.17773354999997,899.00165688000004,1394.88801171,1597.5100423200001]
[{"$f":"HLOOKUP(INDICE!$F$2,Nombres!$C$3:$E$853,55)","v":"Income tax"},-224.15394582000002,-267.97344676,-219.88680231000001,-166.41702186000001,-365.25100197000006,-412.63101626000002]
[{"$f":"HLOOKUP(INDICE!$F$2,Nombres!$C$3:$E$853,269)","v":"Net income from ongoing operations"},641.33507269000006,768.75796998999999,645.29093124000008,732.58463501999995,1029.6370097400002,1184.8790260599999]
[{"$f":"HLOOKUP(INDICE!$F$2,Nombres!$C$3:$E$853,270)","v":"Result from corporate operations"},0,0,0,0,582.94200000000001,144.274]
[{"$f":"HLOOKUP(INDICE!$F$2,Nombres!$C$3:$E$853,56)","v":"Net income"},641.33507269000006,768.75796998999999,645.29093124000008,732.58463501999995,1612.5790097399999,1329.15302606]
[{"$f":"HLOOKUP(INDICE!$F$2,Nombres!$C$3:$E$853,57)","v":"Non-controlling interests"},-73.961018999999993,-81.845348000000001,-92.824336000000002,-83.791179,-91.169002000000006,-101.19601400000001]
[{"$f":"HLOOKUP(INDICE!$F$2,Nombres!$C$3:$E$853,58)","v":"Net attributable profit"},567.37405368999998,686.91262198999993,552.46659524000006,648.79345601999989,1521.4100077400001,1227.9570120600001]
[{"$f":"HLOOKUP(INDICE!$F$2,Nombres!$C$3:$E$853,242)","v":"Net attributable profit (excluding results from corporate operations) (**)"},567.37405368999998,686.91262198999993,552.46659524000006,648.79345601999989,938.46800774000008,1083.68301206]
[{"$f":"HLOOKUP(INDICE!$F$2,Nombres!$C$3:$E$853,289)","v":"(*) Financial statements with the revenues and expenses of the Garanti Group consolidated in proportion to the percentage of the Group's stake."}]
[{"$f":"HLOOKUP(INDICE!$F$2,Nombres!$C$3:$E$853,29)","v":"(**) 2015 includes the capitral gains from the various sale operations equivalent to 6.34 of BBVA Group's stake in CNCB and the badwill from Catalunya Banc operation. "}]
[{"$f":"HLOOKUP(INDICE!$F$2,Nombres!$C$3:$E$853,290)","v":"Consolidated income statement (*)"}]
[{"$f":"HLOOKUP(INDICE!$F$2,Nombres!$C$3:$E$853,31)","v":"(Constant million euros)    "}]
[null,2014,null,null,null,2015]
[null,{"$f":"HLOOKUP(INDICE!$F$2,Nombres!$C$3:$E$857,34)","v":"1st Quarter"},{"$f":"HLOOKUP(INDICE!$F$2,Nombres!$C$3:$E$857,35)","v":"2nd Quarter"},{"$f":"HLOOKUP(INDICE!$F$2,Nombres!$C$3:$E$857,36)","v":"3rd Quarter"},{"$f":"HLOOKUP(INDICE!$F$2,Nombres!$C$3:$E$857,37)","v":"4th Quarter"},{"$f":"HLOOKUP(INDICE!$F$2,Nombres!$C$3:$E$857,34)","v":"1st Quarter"},{"$f":"HLOOKUP(INDICE!$F$2,Nombres!$C$3:$E$857,35)","v":"2nd Quarter"}]
[{"$f":"HLOOKUP(INDICE!$F$2,Nombres!$C$3:$E$853,38)","v":"Net interest income"},3310.7470188223997,3390.0373066626998,3456.6116953378996,3691.2291344088999,3616.1645425747001,3810.6374567553003]
[{"$f":"HLOOKUP(INDICE!$F$2,Nombres!$C$3:$E$853,39)","v":"Net fees and commissions"},1011.8583011168,1097.4038165935999,1074.10135571,1088.8452683643,1069.0325333249,1132.9204690250999]
[{"$f":"HLOOKUP(INDICE!$F$2,Nombres!$C$3:$E$853,40)","v":"Net trading income"},698.80445120529998,434.19142586629999,439.10598923359998,511.70641943729999,704.13463283509998,631.3864212249]
[{"$f":"HLOOKUP(INDICE!$F$2,Nombres!$C$3:$E$853,41)","v":"Dividends"},29.671134051199999,343.90103359060004,42.856420014599998,119.480313337,41.929934135099998,194.16706628489999]
[{"$f":"HLOOKUP(INDICE!$F$2,Nombres!$C$3:$E$853,42)","v":"Income by the equity method"},-12.998634022300001,16.883760353100001,31.6324140515,3.6519721719999989,2.8342938240000013,18.155706176000002]
[{"$f":"HLOOKUP(INDICE!$F$2,Nombres!$C$3:$E$853,43)","v":"Other operating income and expenses"},33.852178375400001,49.967362767399997,11.988545455800001,69.941544817100009,95.212348569699998,109.8816524403]
[{"$f":"HLOOKUP(INDICE!$F$2,Nombres!$C$3:$E$853,44)","v":"Gross income"},5071.9344495486002,5332.3847058335996,5056.2964198033005,5484.8546525367001,5529.3082852633997,5897.1487719064999]
[{"$f":"HLOOKUP(INDICE!$F$2,Nombres!$C$3:$E$853,45)","v":"Operating expenses"},-2675.3768462794997,-2672.3741998623,-2724.9666576731001,-2753.4398062762002,-2757.9843209947003,-2926.0866822851999]
[{"$f":"HLOOKUP(INDICE!$F$2,Nombres!$C$3:$E$853,46)","v":"  Administration expenses"},-2392.4009567594999,-2389.7201316334999,-2438.0631517950001,-2469.4772100375003,-2468.5820010079001,-2629.6020000819999]
[{"$f":"HLOOKUP(INDICE!$F$2,Nombres!$C$3:$E$853,47)","v":"  Personnel expenses"},-1421.2104639734,-1384.4331642512,-1440.3953562971999,-1402.1709142962,-1453.3994489918,-1531.9375557282001]
[{"$f":"HLOOKUP(INDICE!$F$2,Nombres!$C$3:$E$853,48)","v":"  General and administrative expenses"},-971.19049278600005,-1005.2869673823001,-997.66779549779994,-1067.3062957414002,-1015.1825520162001,-1097.6644443537998]
[{"$f":"HLOOKUP(INDICE!$F$2,Nombres!$C$3:$E$853,49)","v":"  Depreciation and amortization"},-282.97588952000001,-282.65406822860001,-286.90350587810002,-283.96259623859999,-289.40231998690001,-296.48468220320001]
[{"$f":"HLOOKUP(INDICE!$F$2,Nombres!$C$3:$E$853,50)","v":"Operating income"},2396.5576032692002,2660.0105059713001,2331.3297621301999,2731.4148462603998,2771.3239642687004,2971.0620896213995]
[{"$f":"HLOOKUP(INDICE!$F$2,Nombres!$C$3:$E$853,51)","v":"Impairment on financial assets (net)"},-1121.5440670951998,-1056.8913814519001,-1089.3675163860999,-1096.3144936377998,-1113.9270829723,-1084.6039167776999]
[{"$f":"HLOOKUP(INDICE!$F$2,Nombres!$C$3:$E$853,52)","v":"Provisions"},-130.09162213460002,-285.4950532638,-178.62753994439998,-471.34320612859995,-200.64492053679999,-161.81407960320001]
[{"$f":"HLOOKUP(INDICE!$F$2,Nombres!$C$3:$E$853,53)","v":"Other gains (losses)"},-173.9666130002,-190.6247435004,-135.0346153598,-203.30408105880002,-65.987970775300013,-123.0100291947]
[{"$f":"HLOOKUP(INDICE!$F$2,Nombres!$C$3:$E$853,54)","v":"Income before tax"},970.95530103930002,1126.9993277552999,928.30009044000008,960.45306543550009,1390.7639899843,1601.6340640457997]
[{"$f":"HLOOKUP(INDICE!$F$2,Nombres!$C$3:$E$853,55)","v":"Income tax"},-250.52872581950001,-290.47552584710002,-232.286345146,-182.53256105600002,-364.28450363160005,-413.59751459839998]
[{"$f":"HLOOKUP(INDICE!$F$2,Nombres!$C$3:$E$853,269)","v":"Net income from ongoing operations"},720.42657521990009,836.523801908,696.01374529400005,777.92050437930004,1026.4794863527,1188.0365494475]
[{"$f":"HLOOKUP(INDICE!$F$2,Nombres!$C$3:$E$853,270)","v":"Result from corporate operations"},0,0,0,0,582.94200000000001,144.274]
[{"$f":"HLOOKUP(INDICE!$F$2,Nombres!$C$3:$E$853,56)","v":"Net income"},720.42657521990009,836.523801908,696.01374529400005,777.92050437929993,1609.4214863527,1332.3105494474999]
[{"$f":"HLOOKUP(INDICE!$F$2,Nombres!$C$3:$E$853,57)","v":"Non-controlling interests"},-80.611496758300007,-90.1036253157,-100.9994081377,-89.174751773400004,-91.033476672299997,-101.33153932759998]
[{"$f":"HLOOKUP(INDICE!$F$2,Nombres!$C$3:$E$853,58)","v":"Net attributable profit"},639.81507846160002,746.42017659229998,595.01433715619999,688.74575260589995,1518.3880096803,1230.9790101198]
[{"$f":"HLOOKUP(INDICE!$F$2,Nombres!$C$3:$E$853,242)","v":"Net attributable profit (excluding results from corporate operations) (**)"},639.81507846160002,746.42017659229998,595.01433715619999,688.74575260589995,935.44600968029999,1086.7050101198001]
[]
[{"$f":"HLOOKUP(INDICE!$F$2,Nombres!$C$3:$E$853,289)","v":"(*) Financial statements with the revenues and expenses of the Garanti Group consolidated in proportion to the percentage of the Group's stake."}]
[{"$f":"HLOOKUP(INDICE!$F$2,Nombres!$C$3:$E$853,29)","v":"(**) 2015 includes the capitral gains from the various sale operations equivalent to 6.34 of BBVA Group's stake in CNCB and the badwill from Catalunya Banc operation. "}]

{"sheet":"Corporate & Investment Banking","index":19,"n_rows":102,"n_cols":7,"rows_kept":102,"cut":false,"hidden":false,"merged":[[3,1,3,4],[3,5,3,6],[53,1,53,4],[53,5,53,6]]}
[{"$f":"HLOOKUP(INDICE!$F$2,Nombres!$C$3:$E$853,186)","v":"Corporate & Investment Banking"}]
[{"$f":"HLOOKUP(INDICE!$F$2,Nombres!$C$3:$E$853,93)","v":"Income statement  "}]
[{"$f":"HLOOKUP(INDICE!$F$2,Nombres!$C$3:$E$853,30)","v":"(Million euros)"}]
[null,2014,null,null,null,2015]
[null,{"$f":"HLOOKUP(INDICE!$F$2,Nombres!$C$3:$E$857,34)","v":"1st Quarter"},{"$f":"HLOOKUP(INDICE!$F$2,Nombres!$C$3:$E$857,35)","v":"2nd Quarter"},{"$f":"HLOOKUP(INDICE!$F$2,Nombres!$C$3:$E$857,36)","v":"3rd Quarter"},{"$f":"HLOOKUP(INDICE!$F$2,Nombres!$C$3:$E$857,37)","v":"4th Quarter"},{"$f":"HLOOKUP(INDICE!$F$2,Nombres!$C$3:$E$857,34)","v":"1st Quarter"},{"$f":"HLOOKUP(INDICE!$F$2,Nombres!$C$3:$E$857,35)","v":"2nd Quarter"}]
[{"$f":"HLOOKUP(INDICE!$F$2,Nombres!$C$3:$E$853,38)","v":"Net interest income"},369.56927440999999,381.63450563999999,381.67995410000003,381.89151240000001,341.74580070000002,361.24870156999998]
[{"$f":"HLOOKUP(INDICE!$F$2,Nombres!$C$3:$E$853,39)","v":"Net fees and commissions"},174.65282094150001,197.30057568149999,173.08709782150001,182.3461059915,186.45298887999999,176.31341171]
[{"$f":"HLOOKUP(INDICE!$F$2,Nombres!$C$3:$E$853,40)","v":"Net trading income"},251.4399071,20.58793137,98.331603739999991,164.18251967,232.68302783999999,213.86374702000001]
[{"$f":"HLOOKUP(INDICE!$F$2,Nombres!$C$3:$E$853,95)","v":"Other income/expenses"},-5.5777410900000008,54.309765110000001,-1.1465682299999989,6.3484415099999998,15.543038119999999,50.857175119999994]
[{"$f":"HLOOKUP(INDICE!$F$2,Nombres!$C$3:$E$853,44)","v":"Gross income"},790.08426136150001,653.83277780150001,651.95208743149999,734.76857957149991,776.42485553999995,802.28303542000003]
[{"$f":"HLOOKUP(INDICE!$F$2,Nombres!$C$3:$E$853,45)","v":"Operating expenses"},-214.97365633999999,-234.1146932899,-235.96397912010002,-234.70622934999997,-243.00441287000001,-247.63462511]
[{"$f":"HLOOKUP(INDICE!$F$2,Nombres!$C$3:$E$853,46)","v":"  Administration expenses"},-210.46341941000003,-229.43908079169998,-231.36209160829998,-229.26306362999998,-237.41367602999998,-241.93516273]
[{"$f":"HLOOKUP(INDICE!$F$2,Nombres!$C$3:$E$853,47)","v":"  Personnel expenses"},-117.52499076000001,-118.71308141,-120.56293640999999,-117.33212075,-124.00506576999999,-127.84606314999999]
[{"$f":"HLOOKUP(INDICE!$F$2,Nombres!$C$3:$E$853,48)","v":"  General and administrative expenses"},-92.938428650000006,-110.72599938170001,-110.7991551983,-111.93094288,-113.40861026,-114.08909958]
[{"$f":"HLOOKUP(INDICE!$F$2,Nombres!$C$3:$E$853,49)","v":"  Depreciation and amortization"},-4.5102369299999996,-4.6756124981999996,-4.6018875117999993,-5.4431657199999997,-5.5907368399999999,-5.6994623799999999]
[{"$f":"HLOOKUP(INDICE!$F$2,Nombres!$C$3:$E$853,50)","v":"Operating income"},575.11060502149996,419.71808451159995,415.98810831140008,500.06235022149997,533.42044267000006,554.64841031000003]
[{"$f":"HLOOKUP(INDICE!$F$2,Nombres!$C$3:$E$853,51)","v":"Impairment on financial assets (net)"},-43.609875629999998,-73.288436840000003,-33.393868339999997,-49.978840140000003,-22.74455201,-23.65797448]
[{"$f":"HLOOKUP(INDICE!$F$2,Nombres!$C$3:$E$853,160)","v":"Provisions (net) and other gains/losses"},3.18211238,-11.565417679999999,4.7419194399999993,-62.008970579999996,2.3757897699999999,5.0742932300000003]
[{"$f":"HLOOKUP(INDICE!$F$2,Nombres!$C$3:$E$853,54)","v":"Income before tax"},534.68284177149997,334.86422999159998,387.33615941139999,388.0745395015,513.05168043000003,536.06472905999999]
[{"$f":"HLOOKUP(INDICE!$F$2,Nombres!$C$3:$E$853,55)","v":"Income tax"},-162.29440595,-83.951739668000002,-102.586090412,-104.37973022,-144.49103996999997,-164.37083339]
[{"$f":"HLOOKUP(INDICE!$F$2,Nombres!$C$3:$E$853,56)","v":"Net income"},372.38843582150002,250.91249032349998,284.75006899940001,283.6948092815,368.56064046000006,371.69389566999996]
[{"$f":"HLOOKUP(INDICE!$F$2,Nombres!$C$3:$E$853,57)","v":"Non-controlling interests"},-36.181165399999998,-35.217299560000001,-37.158635759999996,-31.581491870000001,-46.373860989999997,-27.299921650000002]
[{"$f":"HLOOKUP(INDICE!$F$2,Nombres!$C$3:$E$853,58)","v":"Net attributable profit"},336.20727042149997,215.69519076349999,247.59143323940003,252.11331741149999,322.18677947000003,344.39397402000003]
[{"$f":"HLOOKUP(INDICE!$F$2,Nombres!$C$3:$E$853,94)","v":"Balance sheet  "}]
[{"$f":"HLOOKUP(INDICE!$F$2,Nombres!$C$3:$E$853,30)","v":"(Million euros)"}]
[null,"2014-03-31","2014-06-30","2014-09-30","2014-12-31","2015-03-31","2015-06-30"]
[{"$f":"HLOOKUP(INDICE!$F$2,Nombres!$C$3:$E$853,100)","v":"Cash and balances with central banks"},2837.7695193499999,4014.9193258400001,4252.6760686099997,3296.9454660000001,3423.7565090100002,2680.9324382700001]
[{"$f":"HLOOKUP(INDICE!$F$2,Nombres!$C$3:$E$853,101)","v":"Financial assets"},84630.942462909996,88782.419838119997,97761.375207370002,93647.736608360006,103224.4313574,93237.025490309999]
[{"$f":"HLOOKUP(INDICE!$F$2,Nombres!$C$3:$E$853,102)","v":"Loans and receivables"},65180.630379839997,72481.897013499998,73707.270697979999,76096.009298799996,89074.659574439997,81740.925944999995]
[{"$f":"HLOOKUP(INDICE!$F$2,Nombres!$C$3:$E$853,103)","v":"  . Loans and advances to customers"},48385.208483369999,50336.296890400001,50889.082396930004,51841.481130209999,57593.071613270004,55455.48237862]
[{"$f":"HLOOKUP(INDICE!$F$2,Nombres!$C$3:$E$853,104)","v":"  . Loans and advances to credit institutions and other"},16795.421896470001,22145.600123100001,22818.188301049999,24254.528168589997,31481.58796117,26285.44356638]
[{"$f":"HLOOKUP(INDICE!$F$2,Nombres!$C$3:$E$853,105)","v":"Inter-area positions"},0,0,0,3212.2945232699858,0,0]
[{"$f":"HLOOKUP(INDICE!$F$2,Nombres!$C$3:$E$853,106)","v":"Tangible assets"},25.18688848,24.195250949999998,24.44187792,23.486391009999998,56.207336640000001,51.412600949999998]
[{"$f":"HLOOKUP(INDICE!$F$2,Nombres!$C$3:$E$853,107)","v":"Other assets"},3443.8550486099998,4277.4789705599997,4859.5907338999996,3424.0292084100001,4967.5563592999997,3045.3015775499998]
[{"$f":"HLOOKUP(INDICE!$F$2,Nombres!$C$3:$E$853,108)","v":"Total assets / Liabilities and equity"},156118.38429919002,169580.91039897001,180605.35458578001,179700.50149585001,200746.61113679002,180755.59805207996]
[{"$f":"HLOOKUP(INDICE!$F$2,Nombres!$C$3:$E$853,109)","v":"Deposits from central banks and credit institutions"},53983.139548489999,56591.791860099998,48304.274698629997,59923.349326080002,51685.629066349997,55401.781529690001]
[{"$f":"HLOOKUP(INDICE!$F$2,Nombres!$C$3:$E$853,110)","v":"Deposits from customers"},38836.472312049998,45518.920433270003,49723.782417859999,51295.150555840002,58461.940923609996,51363.655208750002]
[{"$f":"HLOOKUP(INDICE!$F$2,Nombres!$C$3:$E$853,111)","v":"Debt certificates"},-66.612595119999995,-69.751269730000004,17.66093931,-8.6853063699999993,-18.770195149999999,1587.5534669599999]
[{"$f":"HLOOKUP(INDICE!$F$2,Nombres!$C$3:$E$853,112)","v":"Subordinated liabilities"},1298.20459914,1258.59857704,1273.9599268699999,1513.8720601499999,1875.35027799,1663.1377182399999]
[{"$f":"HLOOKUP(INDICE!$F$2,Nombres!$C$3:$E$853,113)","v":"Inter-area positions"},4744.3598391599953,5679.6358708800108,12776.315457360004,0,12080.533193280047,5263.891991589946]
[{"$f":"HLOOKUP(INDICE!$F$2,Nombres!$C$3:$E$853,114)","v":"Financial liabilities held for trading "},49550.279945330003,52035.12982432,59215.289155450002,57331.619962960001,67361.873540560002,56571.931987180003]
[{"$f":"HLOOKUP(INDICE!$F$2,Nombres!$C$3:$E$853,115)","v":"Other liabilities"},3678.1056683900001,4451.2234913599996,5289.6487473199995,5569.6842607300005,5110.7055001500012,4744.9668396699999]
[{"$f":"HLOOKUP(INDICE!$F$2,Nombres!$C$3:$E$853,116)","v":"Economic capital allocated"},4094.4349817500001,4115.3616117299998,4004.4232429799999,4075.5106364600001,4189.3488299999999,4158.6793100000004]
[{"$f":"HLOOKUP(INDICE!$F$2,Nombres!$C$3:$E$853,117)","v":"Relevant business indicators"}]
[{"$f":"HLOOKUP(INDICE!$F$2,Nombres!$C$3:$E$853,201)","v":"Annex:"}]
[{"$f":"HLOOKUP(INDICE!$F$2,Nombres!$C$3:$E$853,30)","v":"(Million euros)"},"2014-03-31","2014-06-30","2014-09-30","2014-12-31","2015-03-31","2015-06-30"]
[{"$f":"HLOOKUP(INDICE!$F$2,Nombres!$C$3:$E$853,118)","v":"Loans and advances to customers gross"},49330.841977199998,51368.892935519994,51737.483523769995,52730.461058319997,58465.620081820001,56405.411752900007]
[{"$f":"HLOOKUP(INDICE!$F$2,Nombres!$C$3:$E$853,121)","v":"Customer deposits under management (*)"},29197.380131919999,32149.431313159999,35883.52013194,36743.565511270004,40030.161694089998,37092.283872209999]
[{"$f":"HLOOKUP(INDICE!$F$2,Nombres!$C$3:$E$853,122)","v":"Mutual funds"},984.15680462,766.18384184000001,1050.2220777699999,1093.05987207,1313.55450025,1332.2498067700001]
[{"$f":"HLOOKUP(INDICE!$F$2,Nombres!$C$3:$E$853,206)","v":"Pension funds"},2.9688200000000001E-3,3.1363799999999998E-3,3.2584699999999999E-3,3.45058E-3,1.87477E-3,1.9164900000000001E-3]
[{"$f":"HLOOKUP(INDICE!$F$2,Nombres!$C$3:$E$853,286)","v":"(*) Includes area's repos in Mexico."}]
[{"$f":"HLOOKUP(INDICE!$F$2,Nombres!$C$3:$E$853,93)","v":"Income statement  "}]
[{"$f":"HLOOKUP(INDICE!$F$2,Nombres!$C$3:$E$853,31)","v":"(Constant million euros)    "}]
[null,2014,null,null,null,2015]
[null,{"$f":"HLOOKUP(INDICE!$F$2,Nombres!$C$3:$E$857,34)","v":"1st Quarter"},{"$f":"HLOOKUP(INDICE!$F$2,Nombres!$C$3:$E$857,35)","v":"2nd Quarter"},{"$f":"HLOOKUP(INDICE!$F$2,Nombres!$C$3:$E$857,36)","v":"3rd Quarter"},{"$f":"HLOOKUP(INDICE!$F$2,Nombres!$C$3:$E$857,37)","v":"4th Quarter"},{"$f":"HLOOKUP(INDICE!$F$2,Nombres!$C$3:$E$857,34)","v":"1st Quarter"},{"$f":"HLOOKUP(INDICE!$F$2,Nombres!$C$3:$E$857,35)","v":"2nd Quarter"}]
[{"$f":"HLOOKUP(INDICE!$F$2,Nombres!$C$3:$E$853,38)","v":"Net interest income"},349.7272192099,348.62866045240003,346.81175348750003,345.12270826420001,341.43633413640003,361.55816813360002]
[{"$f":"HLOOKUP(INDICE!$F$2,Nombres!$C$3:$E$853,39)","v":"Net fees and commissions"},182.49286244040002,203.6884113207,175.5216052534,184.29479667569998,186.46438156099998,176.30201902900001]
[{"$f":"HLOOKUP(INDICE!$F$2,Nombres!$C$3:$E$853,40)","v":"Net trading income"},233.93114216689997,30.0056083351,95.738831848399997,167.9549120433,230.88429693,215.66247793010001]
[{"$f":"HLOOKUP(INDICE!$F$2,Nombres!$C$3:$E$853,95)","v":"Other income/expenses"},3.6238514473000003,65.617764138400005,9.7421681548000016,19.3022547787,15.583087914,50.817125326100005]
[{"$f":"HLOOKUP(INDICE!$F$2,Nombres!$C$3:$E$853,44)","v":"Gross income"},769.77507526429997,647.94044424639992,627.81435874420004,716.67467176190007,774.36810054149998,804.33979041859993]
[{"$f":"HLOOKUP(INDICE!$F$2,Nombres!$C$3:$E$853,45)","v":"Operating expenses"},-220.2056450634,-239.90052336229999,-237.31896846789999,-232.1816248765,-242.77191968969998,-247.8671182903]
[{"$f":"HLOOKUP(INDICE!$F$2,Nombres!$C$3:$E$853,46)","v":"  Administration expenses"},-215.28964694119998,-234.84842509910001,-232.59587862079999,-226.6265898753,-237.20159587760003,-242.14724288229999]
[{"$f":"HLOOKUP(INDICE!$F$2,Nombres!$C$3:$E$853,47)","v":"  Personnel expenses"},-122.8668744192,-123.6972133092,-123.13362049540001,-118.2068090761,-123.8309665546,-128.0201623653]
[{"$f":"HLOOKUP(INDICE!$F$2,Nombres!$C$3:$E$853,48)","v":"  General and administrative expenses"},-92.422772522100004,-111.15121179,-109.4622581254,-108.4197807993,-113.370629323,-114.127080517]
[{"$f":"HLOOKUP(INDICE!$F$2,Nombres!$C$3:$E$853,49)","v":"  Depreciation and amortization"},-4.9159981221999995,-5.0520982630999995,-4.7230898469000007,-5.5550350013000003,-5.5703238120999998,-5.7198754079]
[{"$f":"HLOOKUP(INDICE!$F$2,Nombres!$C$3:$E$853,50)","v":"Operating income"},549.5694302009,408.03992088409996,390.49539027629999,484.49304688539996,531.5961808518,556.47267212840006]
[{"$f":"HLOOKUP(INDICE!$F$2,Nombres!$C$3:$E$853,51)","v":"Impairment on financial assets (net)"},-41.547483536999998,-73.801123769700013,-30.837627094799998,-53.173215511999999,-22.649240657,-23.753285833]
[{"$f":"HLOOKUP(INDICE!$F$2,Nombres!$C$3:$E$853,160)","v":"Provisions (net) and other gains/losses"},6.2757713967999997,-10.5107219609,7.1942604973999993,-64.913408825399998,2.3865679003000007,5.0635150996]
[{"$f":"HLOOKUP(INDICE!$F$2,Nombres!$C$3:$E$853,54)","v":"Income before tax"},514.2977180606,323.7280751536,366.85202367889997,366.40642254789998,511.3335080951,537.78290139489991]
[{"$f":"HLOOKUP(INDICE!$F$2,Nombres!$C$3:$E$853,55)","v":"Income tax"},-154.38927873440002,-93.000806163500002,-99.511558879299997,-105.438571467,-143.83440847439999,-165.0274648857]
[{"$f":"HLOOKUP(INDICE!$F$2,Nombres!$C$3:$E$853,56)","v":"Net income"},359.90843932610005,230.72726898990001,267.3404647996,260.9678510809,367.49909962070001,372.7554365094]
[{"$f":"HLOOKUP(INDICE!$F$2,Nombres!$C$3:$E$853,57)","v":"Non-controlling interests"},-25.108150481700001,-23.1631204398,-27.070547872600002,-19.595060932699997,-45.697909732100001,-27.975872907899998]
[{"$f":"HLOOKUP(INDICE!$F$2,Nombres!$C$3:$E$853,58)","v":"Net attributable profit"},334.80028884440003,207.56414855010001,240.269916927,241.37279014820001,321.80118988870004,344.77956360129997]
[{"$f":"HLOOKUP(INDICE!$F$2,Nombres!$C$3:$E$853,94)","v":"Balance sheet  "}]
[{"$f":"HLOOKUP(INDICE!$F$2,Nombres!$C$3:$E$853,31)","v":"(Constant million euros)    "}]
[null,"2014-03-31","2014-06-30","2014-09-30","2014-12-31","2015-03-31","2015-06-30"]
[{"$f":"HLOOKUP(INDICE!$F$2,Nombres!$C$3:$E$853,100)","v":"Cash and balances with central banks"},2498.2686845553999,3591.2895696982,3591.4636235583998,2448.8967016185002,3143.2764487812001,2680.9324382700001]
[{"$f":"HLOOKUP(INDICE!$F$2,Nombres!$C$3:$E$853,101)","v":"Financial assets"},85235.052258324402,89039.968979307698,97283.273310097895,94231.546949835101,102035.1243611422,93237.025490309999]
[{"$f":"HLOOKUP(INDICE!$F$2,Nombres!$C$3:$E$853,102)","v":"Loans and receivables"},67097.438002478404,74057.439167707897,74269.270204745495,76976.837252516299,87324.431895634494,81740.925944999995]
[{"$f":"HLOOKUP(INDICE!$F$2,Nombres!$C$3:$E$853,103)","v":"  . Loans and advances to customers"},50034.011560305997,51647.0128102206,51328.773464766098,52598.156197955999,56223.141138148298,55455.48237862]
[{"$f":"HLOOKUP(INDICE!$F$2,Nombres!$C$3:$E$853,104)","v":"  . Loans and advances to credit institutions and other"},17063.4264421724,22410.426357487198,22940.4967399794,24378.681054560198,31101.290757486102,26285.44356638]
[{"$f":"HLOOKUP(INDICE!$F$2,Nombres!$C$3:$E$853,105)","v":"Inter-area positions"},0,0,0,0,0,0]
[{"$f":"HLOOKUP(INDICE!$F$2,Nombres!$C$3:$E$853,106)","v":"Tangible assets"},27.273359622400001,25.976072983600002,25.225900402299999,24.211218009900001,53.661104355699997,51.412600949999998]
[{"$f":"HLOOKUP(INDICE!$F$2,Nombres!$C$3:$E$853,107)","v":"Other assets"},3500.8819255943999,4315.7666098276004,4930.9093545987998,3431.7258382977002,4869.9937425182998,3045.3015775499998]
[{"$f":"HLOOKUP(INDICE!$F$2,Nombres!$C$3:$E$853,108)","v":"Total assets / Liabilities and equity"},158358.914230575,171030.44039952511,180100.14239340296,177113.2179602774,197426.48755243182,180755.59805207996]
[{"$f":"HLOOKUP(INDICE!$F$2,Nombres!$C$3:$E$853,109)","v":"Deposits from central banks and credit institutions"},54358.155902110702,56812.792654631601,47969.6425686355,60203.239948096001,51013.485561726797,55401.781529690001]
[{"$f":"HLOOKUP(INDICE!$F$2,Nombres!$C$3:$E$853,110)","v":"Deposits from customers"},36493.966553781996,43127.5351237863,46296.2079273665,47621.555298695101,57532.008088732102,51363.655208750002]
[{"$f":"HLOOKUP(INDICE!$F$2,Nombres!$C$3:$E$853,111)","v":"Debt certificates"},-63.636813407299996,-65.585442569700007,21.807244016399999,-7.8405445855,-21.773195580599999,1587.5534669599999]
[{"$f":"HLOOKUP(INDICE!$F$2,Nombres!$C$3:$E$853,112)","v":"Subordinated liabilities"},1322.994984252,1270.9277182666001,1257.7592995692,1533.5078989502999,1798.2652852877,1663.1377182399999]
[{"$f":"HLOOKUP(INDICE!$F$2,Nombres!$C$3:$E$853,113)","v":"Inter-area positions"},8659.2252222317911,9136.5172786950134,16016.974924827256,514.854680989607,10999.927344058611,5263.891991589946]
[{"$f":"HLOOKUP(INDICE!$F$2,Nombres!$C$3:$E$853,114)","v":"Financial liabilities held for trading "},49744.365370713502,52156.974965167399,59287.8890406801,57636.078219242598,67010.246268651405,56571.931987180003]
[{"$f":"HLOOKUP(INDICE!$F$2,Nombres!$C$3:$E$853,115)","v":"Other liabilities"},3685.5060724361001,4447.8364677341997,5296.2531766903003,5572.7038719231996,5010.1283663873,4744.9668396699999]
[{"$f":"HLOOKUP(INDICE!$F$2,Nombres!$C$3:$E$853,116)","v":"Economic capital allocated"},4158.3369384562002,4143.4416338136998,3953.6082116179,4039.1185869660999,4084.1998331684999,4158.6793100000004]
[{"$f":"HLOOKUP(INDICE!$F$2,Nombres!$C$3:$E$853,117)","v":"Relevant business indicators"}]
[{"$f":"HLOOKUP(INDICE!$F$2,Nombres!$C$3:$E$853,201)","v":"Annex:"}]
[{"$f":"HLOOKUP(INDICE!$F$2,Nombres!$C$3:$E$853,31)","v":"(Constant million euros)    "}]
[null,"2014-03-31","2014-06-30","2014-09-30","2014-12-31","2015-03-31","2015-06-30"]
[{"$f":"HLOOKUP(INDICE!$F$2,Nombres!$C$3:$E$853,118)","v":"Loans and advances to customers gross"},50992.923039895504,52690.084077502703,52173.184020271103,53487.132594919902,57088.293776180602,56405.411752900007]
[{"$f":"HLOOKUP(INDICE!$F$2,Nombres!$C$3:$E$853,121)","v":"Customer deposits under management (*)"},26852.014226398198,29749.555557502899,32454.614734648298,33067.695536591702,39104.107453391007,37092.283872209999]
[{"$f":"HLOOKUP(INDICE!$F$2,Nombres!$C$3:$E$853,122)","v":"Mutual funds"},1025.0513677193001,789.85549077910002,1079.3064988265,1118.1046632644,1250.1998741757,1332.2498067700001]
[{"$f":"HLOOKUP(INDICE!$F$2,Nombres!$C$3:$E$853,206)","v":"Pension funds"},2.9688200000000001E-3,3.1363799999999998E-3,3.2584699999999999E-3,3.45058E-3,1.87477E-3,1.9164900000000001E-3]
[{"$f":"HLOOKUP(INDICE!$F$2,Nombres!$C$3:$E$853,286)","v":"(*) Includes area's repos in Mexico."}]

{"sheet":"Eficiencia","index":20,"n_rows":20,"n_cols":7,"rows_kept":20,"cut":false,"hidden":false,"merged":[]}
[{"$f":"HLOOKUP(INDICE!$F$2,Nombres!$C$3:$E$853,138)","v":"Efficiency (%) (*)"}]
[]
[null,"2014-03-31","2014-06-30","2014-09-30","2014-12-31","2015-03-31","2015-06-30"]
[]
[{"$f":"HLOOKUP(INDICE!$F$2,Nombres!$C$3:$E$853,164)","v":"BBVA Group"},51.732213640045245,50.878139531474375,51.601932637580042,51.276438067999116,49.279639500158012,49.485694611480362]
[]
[{"$f":"HLOOKUP(INDICE!$F$2,Nombres!$C$3:$E$853,301)","v":"Banking activity in Spain"},40.254900809416299,41.941477260566728,43.817844847515744,42.987095108104079,39.466380408722515,40.509446765214555]
[]
[{"$f":"HLOOKUP(INDICE!$F$2,Nombres!$C$3:$E$853,20)","v":"The United States"},67.904933271603696,68.751024116769798,69.900466718957404,70.058646735730676,65.890806398661923,66.257552937339753]
[]
[{"$f":"HLOOKUP(INDICE!$F$2,Nombres!$C$3:$E$853,295)","v":"Turkey"},43.766056846054973,42.160904284408304,41.893173172262173,41.79041299986028,43.952459524236126,43.365088846940438]
[]
[{"$f":"HLOOKUP(INDICE!$F$2,Nombres!$C$3:$E$853,9)","v":"Mexico"},36.934499703470181,36.836088504084749,37.065003532758325,36.898162613438068,36.920772747747293,36.799228338965911]
[]
[{"$f":"HLOOKUP(INDICE!$F$2,Nombres!$C$3:$E$853,12)","v":"South America"},42.703752199635538,44.25621449905109,43.944048104267111,44.618542760048527,43.471782347710267,44.150811446493307]
[]
[{"$f":"HLOOKUP(INDICE!$F$2,Nombres!$C$3:$E$853,184)","v":"Rest of Eurasia"},55.048576579073917,35.574816583003901,42.028443178417959,46.606983903585061,54.83071307384224,66.366043259621051]
[]
[]
[{"$f":"HLOOKUP(INDICE!$F$2,Nombres!$C$3:$E$853,137)","v":"(*) Operating expenses / Gross income. Including depreciation"}]

{"sheet":"Mora,cobertura,prima de riesgo","index":21,"n_rows":55,"n_cols":7,"rows_kept":55,"cut":false,"hidden":false,"merged":[]}
[{"$f":"HLOOKUP(INDICE!$F$2,Nombres!$C$3:$E$853,139)","v":"NPA ratio (%)"}]
[]
[null,"2014-03-31","2014-06-30","2014-09-30","2014-12-31","2015-03-31","2015-06-30"]
[]
[{"$f":"HLOOKUP(INDICE!$F$2,Nombres!$C$3:$E$853,164)","v":"BBVA Group"},6.6000000000000003E-2,6.4000000000000001E-2,6.0999999999999999E-2,5.8000000000000003E-2,5.6000000000000001E-2,6.0999999999999999E-2]
[]
[{"$f":"HLOOKUP(INDICE!$F$2,Nombres!$C$3:$E$853,301)","v":"Banking activity in Spain"},6.4000000000000001E-2,6.3E-2,6.2E-2,0.06,5.8999999999999997E-2,6.8000000000000005E-2]
[]
[{"$f":"HLOOKUP(INDICE!$F$2,Nombres!$C$3:$E$853,20)","v":"The United States"},0.01,8.9999999999999993E-3,8.9999999999999993E-3,8.9999999999999993E-3,8.9999999999999993E-3,8.9999999999999993E-3]
[]
[{"$f":"HLOOKUP(INDICE!$F$2,Nombres!$C$3:$E$853,295)","v":"Turkey"},2.7E-2,2.7E-2,2.5999999999999999E-2,2.8000000000000001E-2,2.5999999999999999E-2,2.7E-2]
[]
[{"$f":"HLOOKUP(INDICE!$F$2,Nombres!$C$3:$E$853,9)","v":"Mexico"},3.4000000000000002E-2,3.4000000000000002E-2,3.2000000000000001E-2,2.9000000000000001E-2,2.8000000000000001E-2,2.8000000000000001E-2]
[]
[{"$f":"HLOOKUP(INDICE!$F$2,Nombres!$C$3:$E$853,12)","v":"South America"},2.1999999999999999E-2,2.1000000000000001E-2,2.1000000000000001E-2,2.1000000000000001E-2,2.3E-2,2.3E-2]
[]
[{"$f":"HLOOKUP(INDICE!$F$2,Nombres!$C$3:$E$853,184)","v":"Rest of Eurasia"},3.7999999999999999E-2,0.04,3.7999999999999999E-2,3.6999999999999998E-2,3.4000000000000002E-2,3.4000000000000002E-2]
[]
[]
[{"$f":"HLOOKUP(INDICE!$F$2,Nombres!$C$3:$E$853,140)","v":"Coverage ratio (%)"}]
[]
[null,"2014-03-31","2014-06-30","2014-09-30","2014-12-31","2015-03-31","2015-06-30"]
[]
[{"$f":"HLOOKUP(INDICE!$F$2,Nombres!$C$3:$E$853,164)","v":"BBVA Group"},0.6,0.62,0.63,0.64,0.65,0.72]
[]
[{"$f":"HLOOKUP(INDICE!$F$2,Nombres!$C$3:$E$853,301)","v":"Banking activity in Spain"},0.41,0.44,0.44,0.45,0.46,0.62]
[]
[{"$f":"HLOOKUP(INDICE!$F$2,Nombres!$C$3:$E$853,20)","v":"The United States"},1.6,1.68,1.64,1.67,1.64,1.51]
[]
[{"$f":"HLOOKUP(INDICE!$F$2,Nombres!$C$3:$E$853,295)","v":"Turkey"},1.1200000000000001,1.1200000000000001,1.1499999999999999,1.1499999999999999,1.18,1.19]
[]
[{"$f":"HLOOKUP(INDICE!$F$2,Nombres!$C$3:$E$853,9)","v":"Mexico"},1.1399999999999999,1.1299999999999999,1.1200000000000001,1.1399999999999999,1.1599999999999999,1.1599999999999999]
[]
[{"$f":"HLOOKUP(INDICE!$F$2,Nombres!$C$3:$E$853,12)","v":"South America"},1.36,1.38,1.37,1.38,1.21,1.22]
[]
[{"$f":"HLOOKUP(INDICE!$F$2,Nombres!$C$3:$E$853,184)","v":"Rest of Eurasia"},0.77,0.79,0.81,0.8,0.82,0.86]
[]
[]
[{"$f":"HLOOKUP(INDICE!$F$2,Nombres!$C$3:$E$853,198)","v":"Cost of risk (%)"}]
[]
[null,"2014-03-31","2014-06-30","2014-09-30","2014-12-31","2015-03-31","2015-06-30"]
[]
[{"$f":"HLOOKUP(INDICE!$F$2,Nombres!$C$3:$E$853,164)","v":"BBVA Group"},1.270086653255716,1.2443658447338286,1.2501626716955558,1.2512788881749144,1.2120893824840293,1.1604231062448223]
[]
[{"$f":"HLOOKUP(INDICE!$F$2,Nombres!$C$3:$E$853,301)","v":"Banking activity in Spain"},1.0394714972845251,0.96893195597298343,0.93371282271085421,0.94976559818936868,0.98797171876480061,0.8561275005949357]
[]
[{"$f":"HLOOKUP(INDICE!$F$2,Nombres!$C$3:$E$853,20)","v":"The United States"},0.19259436142140168,0.20691461411277293,0.17112564064334118,0.1597019062890884,0.22954527578380535,0.22751469504856239]
[]
[{"$f":"HLOOKUP(INDICE!$F$2,Nombres!$C$3:$E$853,295)","v":"Turkey"},0.87777010342604367,0.84632786176651564,1.0979202825214924,1.1630603088178662,0.93708927858853941,1.0002320018152833]
[]
[{"$f":"HLOOKUP(INDICE!$F$2,Nombres!$C$3:$E$853,9)","v":"Mexico"},3.5085245915805383,3.6133557375183756,3.5648245545740447,3.4509220517502812,3.4401072303454914,3.4296209378401685]
[]
[{"$f":"HLOOKUP(INDICE!$F$2,Nombres!$C$3:$E$853,12)","v":"South America"},1.2251954084157433,1.3463877598299889,1.442935198651869,1.4576458055656254,1.0300625875418765,1.2275037926002155]
[]
["Resto de Eurasia",0.48763704657495488,0.45936488587906554,0.4200166560013387,0.31106179543444934,0.54774865142038021,0.34436050521502659]

{"sheet":"Empleados,oficinas y cajeros","index":22,"n_rows":51,"n_cols":7,"rows_kept":51,"cut":false,"hidden":false,"merged":[]}
[{"$f":"HLOOKUP(INDICE!$F$2,Nombres!$C$3:$F$853,141)","v":"Branches"}]
[null,"2014-03-31","2014-06-30","2014-09-30","2014-12-31","2015-03-31","2015-06-30"]
[{"$f":"HLOOKUP(INDICE!$F$2,Nombres!$C$3:$F$853,142)","v":"Spain"},3231,3137,3131,3112,3111,3869]
[{"$f":"HLOOKUP(INDICE!$F$2,Nombres!$C$3:$E$853,184)","v":"Rest of Eurasia"},117,117,118,75,75,75]
[{"$f":"HLOOKUP(INDICE!$F$2,Nombres!$C$3:$E$853,295)","v":"Turkey"},1,1,1,1,1,1]
[{"$f":"HLOOKUP(INDICE!$F$2,Nombres!$C$3:$F$853,143)","v":"America"},4092,4104,4112,4183,4173,4190]
[{"$f":"HLOOKUP(INDICE!$F$2,Nombres!$C$3:$F$853,144)","v":"Mexico"},1795,1802,1802,1831,1820,1831]
[{"$f":"HLOOKUP(INDICE!$F$2,Nombres!$C$3:$F$853,145)","v":"The United States"},686,675,675,675,675,675]
[{"$f":"HLOOKUP(INDICE!$F$2,Nombres!$C$3:$F$853,146)","v":"Argentina"},245,245,248,251,251,251]
[{"$f":"HLOOKUP(INDICE!$F$2,Nombres!$C$3:$F$853,147)","v":"Colombia"},476,483,491,519,522,528]
[{"$f":"HLOOKUP(INDICE!$F$2,Nombres!$C$3:$F$853,148)","v":"Venezuela"},336,339,340,341,341,340]
[{"$f":"HLOOKUP(INDICE!$F$2,Nombres!$C$3:$F$853,149)","v":"Peru"},327,330,330,338,341,344]
[{"$f":"HLOOKUP(INDICE!$F$2,Nombres!$C$3:$F$853,150)","v":"Chile"},158,163,159,161,156,154]
[{"$f":"HLOOKUP(INDICE!$F$2,Nombres!$C$3:$F$853,152)","v":"Paraguay"},24,22,22,22,22,22]
[{"$f":"HLOOKUP(INDICE!$F$2,Nombres!$C$3:$F$853,153)","v":"Uruguay"},34,34,34,34,34,34]
[{"$f":"HLOOKUP(INDICE!$F$2,Nombres!$C$3:$F$853,155)","v":"Bolivia"},9,9,9,9,9,9]
[{"$f":"HLOOKUP(INDICE!$F$2,Nombres!$C$3:$F$853,302)","v":"Brazil"},1,1,1,1,1,1]
[{"$f":"HLOOKUP(INDICE!$F$2,Nombres!$C$3:$F$853,157)","v":"Total"},7441,7359,7362,7371,7360,8135]
[{"$f":"HLOOKUP(INDICE!$F$2,Nombres!$C$3:$F$853,158)","v":"Employees"}]
[null,"2014-03-31","2014-06-30","2014-09-30","2014-12-31","2015-03-31","2015-06-30"]
[{"$f":"HLOOKUP(INDICE!$F$2,Nombres!$C$3:$F$853,142)","v":"Spain"},30385,30074,29600,28620,28711,33604]
[{"$f":"HLOOKUP(INDICE!$F$2,Nombres!$C$3:$E$853,184)","v":"Rest of Eurasia"},1606,1598,1587,1443,1443,1442]
[{"$f":"HLOOKUP(INDICE!$F$2,Nombres!$C$3:$E$853,295)","v":"Turkey"},18,19,18,16,16,16]
[{"$f":"HLOOKUP(INDICE!$F$2,Nombres!$C$3:$F$853,143)","v":"America"},77070,77759,77715,78691,78674,79166]
[{"$f":"HLOOKUP(INDICE!$F$2,Nombres!$C$3:$F$853,144)","v":"Mexico"},36785,37442,37490,38107,37930,38134]
[{"$f":"HLOOKUP(INDICE!$F$2,Nombres!$C$3:$F$853,145)","v":"The United States"},11314,11029,10938,10944,10861,11034]
[{"$f":"HLOOKUP(INDICE!$F$2,Nombres!$C$3:$F$853,146)","v":"Argentina"},5479,5528,5529,5655,5792,5809]
[{"$f":"HLOOKUP(INDICE!$F$2,Nombres!$C$3:$F$853,147)","v":"Colombia"},6378,6491,6579,6678,6851,6967]
[{"$f":"HLOOKUP(INDICE!$F$2,Nombres!$C$3:$F$853,148)","v":"Venezuela"},5285,5283,5244,5363,5288,5276]
[{"$f":"HLOOKUP(INDICE!$F$2,Nombres!$C$3:$F$853,149)","v":"Peru"},5908,5991,5949,5958,5907,5884]
[{"$f":"HLOOKUP(INDICE!$F$2,Nombres!$C$3:$F$853,150)","v":"Chile"},4584,4583,4568,4567,4593,4587]
[{"$f":"HLOOKUP(INDICE!$F$2,Nombres!$C$3:$F$853,152)","v":"Paraguay"},488,486,486,481,480,487]
[{"$f":"HLOOKUP(INDICE!$F$2,Nombres!$C$3:$F$853,153)","v":"Uruguay"},586,639,641,639,636,635]
[{"$f":"HLOOKUP(INDICE!$F$2,Nombres!$C$3:$F$853,155)","v":"Bolivia"},253,277,283,291,328,344]
[{"$f":"HLOOKUP(INDICE!$F$2,Nombres!$C$3:$F$853,302)","v":"Brazil"},9,9,7,8,7,9]
[{"$f":"HLOOKUP(INDICE!$F$2,Nombres!$C$3:$F$853,157)","v":"Total"},109079,109450,108920,108770,108844,114228]
[{"$f":"HLOOKUP(INDICE!$F$2,Nombres!$C$3:$F$853,205)","v":"ATM's"}]
[null,"2014-03-31","2014-06-30","2014-09-30","2014-12-31","2015-03-31","2015-06-30"]
[{"$f":"HLOOKUP(INDICE!$F$2,Nombres!$C$3:$F$853,142)","v":"Spain"},5924,5956,5930,5909,5953,7226]
[{"$f":"HLOOKUP(INDICE!$F$2,Nombres!$C$3:$E$853,184)","v":"Rest of Eurasia"},100,100,100,55,55,55]
[{"$f":"HLOOKUP(INDICE!$F$2,Nombres!$C$3:$F$853,143)","v":"America"},14940,15327,15636,16195,16587,{"$f":"+SUM(G42:G50)","v":17056}]
[{"$f":"HLOOKUP(INDICE!$F$2,Nombres!$C$3:$F$853,144)","v":"Mexico"},7999,8327,8574,8996,9284,9713]
[{"$f":"HLOOKUP(INDICE!$F$2,Nombres!$C$3:$F$853,145)","v":"The United States"},1033,1024,1025,1013,1027,1021]
[{"$f":"HLOOKUP(INDICE!$F$2,Nombres!$C$3:$F$853,146)","v":"Argentina"},655,659,669,686,686,688]
[{"$f":"HLOOKUP(INDICE!$F$2,Nombres!$C$3:$F$853,147)","v":"Colombia"},1129,1141,1153,1210,1222,1227]
[{"$f":"HLOOKUP(INDICE!$F$2,Nombres!$C$3:$F$853,148)","v":"Venezuela"},1919,1962,1975,1990,1999,2030]
[{"$f":"HLOOKUP(INDICE!$F$2,Nombres!$C$3:$F$853,149)","v":"Peru"},1574,1583,1609,1671,1738,1769]
[{"$f":"HLOOKUP(INDICE!$F$2,Nombres!$C$3:$F$853,150)","v":"Chile"},522,522,522,522,523,500]
[{"$f":"HLOOKUP(INDICE!$F$2,Nombres!$C$3:$F$853,152)","v":"Paraguay"},43,43,43,41,42,42]
[{"$f":"HLOOKUP(INDICE!$F$2,Nombres!$C$3:$F$853,153)","v":"Uruguay"},66,66,66,66,66,66]
[{"$f":"HLOOKUP(INDICE!$F$2,Nombres!$C$3:$F$853,157)","v":"Total"},20964,{"$f":"+C41+C40+C39","v":21383},{"$f":"+D41+D40+D39","v":21666},22159,22595,{"$f":"+G41+G39+G40","v":24337}]

{"sheet":"Tipos de cambio","index":23,"n_rows":17,"n_cols":7,"rows_kept":17,"cut":false,"hidden":false,"merged":[[3,1,4,1]]}
[{"$f":"HLOOKUP(INDICE!$F$2,Nombres!$C$3:$F$853,182)","v":"Exchange rates"}]
[{"$f":"HLOOKUP(INDICE!$F$2,Nombres!$C$3:$E$853,167)","v":"(Expressed in currency/euro)"}]
[null,null,{"$f":"HLOOKUP(INDICE!$F$2,Nombres!$C$3:$E$853,175)","v":"Year-end exchange rates (*)"},null,null,{"$f":"HLOOKUP(INDICE!$F$2,Nombres!$C$3:$E$853,176)","v":"Average exchange rates (**)"}]
[null,"2015-06-30",{"$f":"HLOOKUP(INDICE!$F$2,Nombres!$C$3:$E$853,180)","v":"∆ % on"},{"$f":"HLOOKUP(INDICE!$F$2,Nombres!$C$3:$E$853,180)","v":"∆ % on"},null,null,{"$f":"HLOOKUP(INDICE!$F$2,Nombres!$C$3:$E$853,180)","v":"∆ % on"}]
[null,null,"2014-06-30","2015-03-31",null,{"$f":"HLOOKUP(INDICE!$F$2,Nombres!$C$3:$E$853,203)","v":"1H15"},{"$f":"HLOOKUP(INDICE!$F$2,Nombres!$C$3:$E$853,204)","v":"1H14"}]
[{"$f":"HLOOKUP(INDICE!$F$2,Nombres!$C$3:$E$853,168)","v":"Mexican peso"},17.533093714385902,1.0219986538665893,-5.8222288271329745,null,16.884476412386451,6.462224299401413]
[{"$f":"HLOOKUP(INDICE!$F$2,Nombres!$C$3:$E$853,169)","v":"U.S. dollar"},1.1188998976206594,22.066263118502192,-3.8430089063041351,null,1.115529848789929,22.853336878271136]
[{"$f":"HLOOKUP(INDICE!$F$2,Nombres!$C$3:$E$853,170)","v":"Argentine peso"},10.161672204778018,9.2996134879381458,-6.6602801832478065,null,9.8344856072303148,9.0235560273194153]
[{"$f":"HLOOKUP(INDICE!$F$2,Nombres!$C$3:$E$853,171)","v":"Chilean peso"},710.22727272727275,5.8646616541353325,-5.0573162508428737,null,693.00069300069299,9.3181818181818272]
[{"$f":"HLOOKUP(INDICE!$F$2,Nombres!$C$3:$E$853,172)","v":"Colombian peso"},2890.1734104046241,-11.053984575835472,-4.1551246537396054,null,2770.0831024930749,-2.9569892473118244]
[{"$f":"HLOOKUP(INDICE!$F$2,Nombres!$C$3:$E$853,173)","v":"Peruvian new sol"},3.5527260066649138,7.3349120458818078,-6.2109731635311789,null,3.4575875028957297,10.975151180280562]
[{"$f":"HLOOKUP(INDICE!$F$2,Nombres!$C$3:$E$853,174)","v":"Venezuelan bolivar fuerte"},220.75055187637969,-93.441721077700407,-5.9580651858002938,null,220.75055187637969,-93.37079638247431]
[{"$f":"HLOOKUP(INDICE!$F$2,Nombres!$C$3:$E$853,190)","v":"Turkish lira"},2.9953033643247391,-3.2853703827089902,-6.0830426465624043,null,2.8622622175662755,3.6825783093199504]
[]
[]
[{"$f":"HLOOKUP(INDICE!$F$2,Nombres!$C$3:$E$853,177)","v":"(*) Used in the constant euros comparisons for the balance sheet and business activity"}]
[{"$f":"HLOOKUP(INDICE!$F$2,Nombres!$C$3:$E$853,178)","v":"(**) Used in the constant euros comparisons for the profit and loss"}]

{"sheet":"Rendimientos y costes","index":24,"n_rows":22,"n_cols":13,"rows_kept":22,"cut":false,"hidden":false,"merged":[[2,1,2,3]]}
[{"$f":"HLOOKUP(INDICE!$F$2,Nombres!$C$3:$E$853,199)","v":"Breakdown of yields and costs"}]
[]
[]
[null,{"$f":"HLOOKUP(INDICE!$F$2,Nombres!$C$3:$E$853,231)","v":"1st Quarter"},2014,{"$f":"HLOOKUP(INDICE!$F$2,Nombres!$C$3:$E$853,232)","v":"2nd Quarter"},2014,{"$f":"HLOOKUP(INDICE!$F$2,Nombres!$C$3:$E$853,233)","v":"3rd Quarter"},2014,{"$f":"HLOOKUP(INDICE!$F$2,Nombres!$C$3:$E$853,234)","v":"4th Quarter "},2014,{"$f":"HLOOKUP(INDICE!$F$2,Nombres!$C$3:$E$853,231)","v":"1st Quarter"},2015,{"$f":"HLOOKUP(INDICE!$F$2,Nombres!$C$3:$E$853,236)","v":"2nd Quarter"},2015]
[null,{"$f":"HLOOKUP(INDICE!$F$2,Nombres!$C$3:$E$853,239)","v":"% of ATA"},{"$f":"HLOOKUP(INDICE!$F$2,Nombres!$C$3:$E$853,240)","v":"% yield/Cost"},{"$f":"HLOOKUP(INDICE!$F$2,Nombres!$C$3:$E$853,239)","v":"% of ATA"},{"$f":"HLOOKUP(INDICE!$F$2,Nombres!$C$3:$E$853,240)","v":"% yield/Cost"},{"$f":"HLOOKUP(INDICE!$F$2,Nombres!$C$3:$E$853,239)","v":"% of ATA"},{"$f":"HLOOKUP(INDICE!$F$2,Nombres!$C$3:$E$853,240)","v":"% yield/Cost"},{"$f":"HLOOKUP(INDICE!$F$2,Nombres!$C$3:$E$853,239)","v":"% of ATA"},{"$f":"HLOOKUP(INDICE!$F$2,Nombres!$C$3:$E$853,240)","v":"% yield/Cost"},{"$f":"HLOOKUP(INDICE!$F$2,Nombres!$C$3:$E$853,239)","v":"% of ATA"},{"$f":"HLOOKUP(INDICE!$F$2,Nombres!$C$3:$E$853,240)","v":"% yield/Cost"},{"$f":"HLOOKUP(INDICE!$F$2,Nombres!$C$3:$E$853,239)","v":"% of ATA"},{"$f":"HLOOKUP(INDICE!$F$2,Nombres!$C$3:$E$853,240)","v":"% yield/Cost"}]
[{"$f":"HLOOKUP(INDICE!F2,Nombres!$C$3:$E$853,209)","v":"Cash and balances with central banks"},4.5343310391163927,0.55770989767303714,4.5669106931358252,0.51419250436247799,3.8583779913089664,0.39831876204814265,4.4047163332306596,0.49484349402722472,4.5926783133975411,0.24518267739700411,4.0640516744921635,0.11586531604187429]
[{"$f":"HLOOKUP(INDICE!F2,Nombres!$C$3:$E$853,210)","v":"Financial assets and derivatives"},27.480320421462267,2.889152863039278,28.707301850158306,2.6783116076965414,29.059509763108242,2.5627963840494621,29.185422267526295,2.6534599894101083,28.803175543382626,2.2058962180633594,29.349845164282712,2.092636549377354]
[{"$f":"HLOOKUP(INDICE!F2,Nombres!$C$3:$E$853,211)","v":"Loans and advances to credit institutions"},3.9094555200161953,1.5260118947265133,4.1151456196280209,1.2441343861660141,4.4245248842978651,1.0972080982093881,4.318939271252737,1.0099539970206255,4.6155776260721364,0.90955008310072283,4.4427855462087411,0.81714828036831921]
[{"$f":"HLOOKUP(INDICE!F2,Nombres!$C$3:$E$853,212)","v":"Loans and advances to customers"},56.236110011268892,5.3362415279491415,54.882124702309632,5.5376703692633678,54.772753686176365,5.5133625539670588,54.260152184514524,5.812468380378653,54.02537802114864,4.9446587045887354,53.677145219894165,5.0046062694760884]
[{"$f":"HLOOKUP(INDICE!$F$2,Nombres!$C$3:$E$853,213)","v":"Euros"},32.415545063801652,2.6835434326969207,31.067525206840578,2.6309103661683686,30.025720938258672,2.5185627045123193,28.734890118258942,2.464217011325069,27.305780207711983,2.3347469681616135,28.440427231694908,2.3082218676448951]
[{"$f":"HLOOKUP(INDICE!$F$2,Nombres!$C$3:$E$853,216)","v":"Foreign currencies"},23.82056494746724,8.9460910355886352,23.814599495469054,9.3297072533424572,24.747032747917689,9.14697089245497,25.525262066255578,9.5817395803502574,26.719597813436657,7.611827452187514,25.236717988199274,8.0432868302691318]
[{"$f":"HLOOKUP(INDICE!$F$2,Nombres!$C$3:$E$853,217)","v":"Other assets"},7.8397830081362487,0.47686910207784555,7.7285171347682118,0.39997789245888543,7.8848336751085668,0.50444909953428385,7.8307699434757767,0.53501277481129483,7.9631904959990463,0.5001928779880046,8.4661723951222214,0.44087510734454755]
[{"$f":"HLOOKUP(INDICE!$F$2,Nombres!$C$3:$E$853,218)","v":"Total assets"},100,3.9171757924421935,99.999999999999986,3.9136551694848447,100,3.8682464182034839,100,4.0355890630473779,99.999999999999986,3.399811470511465,100,3.3788535806870725]
[{"$f":"HLOOKUP(INDICE!$F$2,Nombres!$C$3:$E$853,219)","v":"Deposits from central banks and credit institutions"},14.208353970649377,1.7992764558366601,13.942305165575872,1.8901979197990071,12.941327762813353,1.7446137821876004,14.615884284572608,1.6366002714426127,13.142757115169834,1.5403691942667757,14.072003443573799,1.4511041951156827]
[{"$f":"HLOOKUP(INDICE!$F$2,Nombres!$C$3:$E$853,220)","v":"Deposits from customers"},51.244977183763083,1.6014941451278446,51.380773493309171,1.5684322695643813,52.145843981577379,1.4495552107749177,50.944553759343314,1.4257636061527812,51.356242065611198,1.147252183618457,51.384483469452057,1.1240322524013819]
[{"$f":"HLOOKUP(INDICE!$F$2,Nombres!$C$3:$E$853,221)","v":"Euros"},26.827826606086575,1.2813965086684802,26.713687177643742,1.1402755999510317,26.726173962453121,0.98261790099651802,25.213988044835872,0.86903811660727226,24.617791944362896,0.6938372425453696,27.185846676568698,0.61232164209050843]
[{"$f":"HLOOKUP(INDICE!$F$2,Nombres!$C$3:$E$853,224)","v":"Foreign currencies"},24.417150577676523,1.9531946378053606,24.667086315665422,2.0321126243782803,25.419670019124258,1.940491865786905,25.730565714507449,1.9713120403926612,26.738450121248309,1.5647062482028751,24.19863679288337,1.6989111728030457]
[{"$f":"HLOOKUP(INDICE!$F$2,Nombres!$C$3:$E$853,225)","v":"Debt certificates and subordinated liabilities"},13.91607517704073,2.4023984452024698,13.663563543246642,2.3610955971101855,13.212695274195346,2.2423805554118168,12.529977515791527,2.2450106950126161,12.752868233238162,2.0196328496069671,12.756385622477099,2.037504971991448]
[{"$f":"HLOOKUP(INDICE!$F$2,Nombres!$C$3:$E$853,226)","v":"Other liabilities"},13.130030271651217,1.3298181476857114,13.509361071366241,0.99523326305270432,14.059915923555483,1.1033477662159392,14.111810802348257,1.282156329870257,14.694883166518968,0.85498643499206595,14.273196312024725,0.79110202347473979]
[{"$f":"HLOOKUP(INDICE!$F$2,Nombres!$C$3:$E$853,227)","v":"Equity"},7.5005633968955765,0,7.5039967265020628,0,7.6402170578584325,"-",7.7977736379442799,0,8.0532949347606735,0,7.5138896238199706,0]
[{"$f":"HLOOKUP(INDICE!$F$2,Nombres!$C$3:$E$853,228)","v":"Total liabilities and equity"},99.999999999999972,1.5852579760613721,100,1.5264692462686669,100,1.4330676643343869,100,1.4277873194665278,100.00004551529882,1.1748324294902341,99.999958471347639,1.1546056148684949]
[{"$f":"HLOOKUP(INDICE!$F$2,Nombres!$C$3:$E$853,229)","v":"Net interest income/Average total assets (ATA)"},null,2.3319178163808214,null,2.3871859232161778,null,2.435178753869097,null,2.60780174358085,null,2.2249790410212311,null,2.2242479658185776]

{"sheet":"Nombres","index":25,"n_rows":308,"n_cols":5,"rows_kept":308,"cut":false,"hidden":true,"merged":[]}
[]
[null,"Orden","Inglés","Castellano"]
[null,1,1,2]
[null,2,"Choose your language","Escoja su idioma"]
[null,{"$f":"B4+1","v":3},"Quarterly series (*) - March 2011. Information by geographies","Series trimestrales (*) - Marzo 2011. Información por geografías"]
[null,4,"BBVA Group. Consolidated Income statement","Grupo BBVA. Cuentas de resultados consolidadas"]
[null,5,"BBVA Group. Consolidated income statement excluding one-offs","Grupo BBVA. Cuentas de resultados consolidadas sin singulares"]
[null,6,"BBVA Group. Consolidated balance sheet","Grupo BBVA. Balances de situación consolidados"]
[null,7,"Banking activity in Spain","Actividad bancaria en España"]
[null,8,"Spain excluding one-offs","España sin singulares"]
[null,9,"Mexico","México"]
[null,10,"Bancomer","Grupo Bancario Bancomer"]
[null,11,"Pensions and Insurance Mexico","Pensiones y Seguros México"]
[null,12,"South America","América del Sur "]
[null,13,"Banking South America","Bancos América del Sur"]
[null,14,"Pensions and Insurance South America","Pensiones y Seguros América del Sur"]
[null,15,"Argentina","Argentina"]
[null,16,"Chile","Chile"]
[null,17,"Colombia","Colombia"]
[null,18,"Peru","Perú"]
[null,19,"Venezuela","Venezuela"]
[null,20,"The United States","Estados Unidos"]
[null,21,"USA excluding one-offs","Estados Unidos sin singulares"]
[null,22,"Wholesale Banking & Asset Management","Wholesale Banking & Asset Management"]
[null,23,"Corporate & Investment Banking","Corporate & Investment Banking"]
[null,24,"Global  Markets","Global  Markets"]
[null,25,"Corporate Center ","Centro Corporativo"]
[null,26,"Efficiency","Eficiencia"]
[null,27,"NPL, coverage ratios and cost of risk","Tasas de mora, cobertura y prima de riesgo"]
[null,28,"Branches, employees and atm´s","Empleados, oficinas y cajeros automáticos"]
[null,29,"(**) 2015 includes the capitral gains from the various sale operations equivalent to 6.34 of BBVA Group's stake in CNCB and the badwill from Catalunya Banc operation. ","(**)2015 incorpora las plusvalías procedentes de las distintas operaciones de venta equivalentes a un 6,34% de la participación del Grupo BBVA en CNCB y el badwill generado por la operación de Catalunya Banc."]
[null,30,"(Million euros)","(Millones de euros)"]
[null,31,"(Constant million euros)    ","(Millones de euros constantes)"]
[null,32,"(Constant million euros and percentages)   ","(Millones de euros constantes y porcentajes)   "]
[null,33,"(Million euros and percentages)   ","(Millones de euros y porcentajes)   "]
[null,34,"1st Quarter","1er Trim."]
[null,35,"2nd Quarter","2º Trim."]
[null,36,"3rd Quarter","3er Trim."]
[null,37,"4th Quarter","4º Trim."]
[null,38,"Net interest income","Margen de intereses"]
[null,39,"Net fees and commissions","Comisiones"]
[null,40,"Net trading income","Resultados de operaciones financieras"]
[null,41,"Dividends","Dividendos"]
[null,42,"Income by the equity method","Resultados por puesta en equivalencia"]
[null,43,"Other operating income and expenses","Otros productos y cargas de explotación"]
[null,44,"Gross income","Margen bruto"]
[null,45,"Operating expenses","Gastos de explotación"]
[null,46,"  Administration expenses","  Gastos de administración"]
[null,47,"  Personnel expenses","  Gastos de personal"]
[null,48,"  General and administrative expenses","  Otros gastos generales de administración"]
[null,49,"  Depreciation and amortization","  Amortizaciones"]
[null,50,"Operating income","Margen neto"]
[null,51,"Impairment on financial assets (net)","Pérdidas por deterioro de activos financieros"]
[null,52,"Provisions","Dotaciones a provisiones"]
[null,53,"Other gains (losses)","Otros resultados"]
[null,54,"Income before tax","Beneficio antes de impuestos"]
[null,55,"Income tax","Impuesto sobre beneficios"]
[null,56,"Net income","Beneficio después de impuestos"]
[null,57,"Non-controlling interests","Resultado atribuido a la minoría"]
[null,58,"Net attributable profit","Beneficio atribuido al Grupo"]
[null,59,"One offs (1)","Resultados singulares netos(*)"]
[null,60,"Net attributable profit (Excluding one-offs) (*)","Beneficio atribuido al Grupo (sin singulares)"]
[null,61,"(*) The third quarter of 2009 and of 2010 includes capital gains from the sale-and-leaseback of retail branches which have been alloted to generic provisions for NPA, with no effect on net attributable profit,","(*) En 2009 y 2010, en el tercer trimestre, plusvalías por venta y posterior arrendamiento de oficinas comerciales que se han aplicado a provisiones genéricas de insolvencias, sin efecto en atribuido,"]
[null,62,"(Constant million euros)    "," (Millones de euros constantes)"]
[null,63,"Cash and balances with central banks","Caja y depósitos en bancos centrales"]
[null,64,"Financial assets held for trading","Cartera de negociación"]
[null,65,"Other financial assets designated at fair value","Otros activos financieros a valor razonable"]
[null,66,"Financial assets available for sale","Activos financieros disponibles para la venta"]
[null,{"$f":"B68+1","v":67},"Loans and receivables","Inversiones crediticias"]
[null,68,". Due from banks",". Depósitos en entidades de crédito"]
[null,69,". Loans and advances to customers",". Crédito a la clientela"]
[null,70,". Other",". Otros activos financieros"]
[null,71,"Held to maturity investments","Cartera de inversion a vencimiento"]
[null,72,"Investments in associates","Participaciones"]
[null,73,"Tangible assets","Activo material"]
[null,74,"Intangible assets","Activo intangible"]
[null,75,"Other assets","Otros activos"]
[null,76,"Total assets","Total activo"]
[null,77,"Financial liabilities held for trading","Cartera de negociación"]
[null,78,"Other financial liabilities at fair value","Otros pasivos financieros a valor razonable"]
[null,79,"Financial liabilities at amortised cost","Pasivos financieros a coste amortizado"]
[null,80,". Deposits from central banks and credit institutions",". Depósitos de bancos centrales y entidades de crédito"]
[null,81,". Deposits from customers",". Depósitos de la clientela"]
[null,82,". Debt certificates",". Débitos representados por valores negociables"]
[null,83,". Subordinated liabilities",". Pasivos subordinados"]
[null,84,". Other financial liabilities",". Otros pasivos financieros"]
[null,85,"Liabilities under insurance contracts","Pasivos por contratos de seguros"]
[null,86,"Other liabilities","Otros pasivos"]
[null,87,"Total liabilities","Total pasivo"]
[null,88,"Minority interests","Intereses minoritarios"]
[null,89,"Valuation adjustments","Ajustes por valoración"]
[null,90,"Shareholders' funds","Fondos propios"]
[null,91,"Equity","Patrimonio neto"]
[null,92,"Total liabilities and equity","Total patrimonio neto y pasivo"]
[null,93,"Income statement  ","Cuentas de resultados  "]
[null,94,"Balance sheet  ","Balances"]
[null,95,"Other income/expenses","Otros ingresos netos"]
[null,96,"Impairment on financial assets (net) (1)","Pérdidas por deterioro de activos financieros"]
[null,97,"Provisions (net) and other gains/losses (1)","Dotaciones a provisiones y otros resultados"]
[null,98,"(*) The third quarter, both for 2009 and 2010, includes 830 and 233 million euros, in capital gains from the sale-and-leaseback of retail branches and insolvency provisions for the same amount.","(*) El tercer trimestre de 2009 y de 2010 incluyen 830 y 233 millones de euros, respectivamente, de plusvalías por venta y posterior arrendamiento de oficinas comerciales y provisiones genéricas de insolvencias por el mismo importe."]
[null,99,"(*) The third quarter, both for 2009 and 2010, excludes 830 and 233 million euros in capital gains from the sale-and-leaseback of retail branches and insolvency provisions for the same amount.","(*) No incluye en el tercer trimestre de 2009 ni de 2010, 830 y 233 millones de euros, respectivamante, de plusvalías por venta y posterior arrendamiento de oficinas comerciales y provisiones genéricas de insolvencias por el mismo importe."]
[null,100,"Cash and balances with central banks","Caja y depósitos en bancos centrales"]
[null,101,"Financial assets","Cartera de títulos"]
[null,102,"Loans and receivables","Inversiones crediticias"]
[null,103,"  . Loans and advances to customers","  . Crédito a la clientela neto"]
[null,104,"  . Loans and advances to credit institutions and other","  . Depósitos en entidades de crédito y otros"]
[null,105,"Inter-area positions","Posiciones inter-áreas activo"]
[null,106,"Tangible assets","Activo material"]
[null,107,"Other assets","Otros activos"]
[null,108,"Total assets / Liabilities and equity","Total activo / pasivo"]
[null,109,"Deposits from central banks and credit institutions","Depósitos de bancos centrales y entidades de crédito"]
[null,110,"Deposits from customers","Depósitos de la clientela"]
[null,111,"Debt certificates","Débitos representados por valores negociables"]
[null,112,"Subordinated liabilities","Pasivos subordinados"]
[null,113,"Inter-area positions","Posiciones inter-áreas pasivo"]
[null,114,"Financial liabilities held for trading ","Cartera de negociación"]
[null,115,"Other liabilities","Otros pasivos"]
[null,116,"Economic capital allocated","Dotación de capital económico"]
[null,117,"Relevant business indicators","Indicadores relevantes"]
[null,118,"Loans and advances to customers gross","Crédito a la clientela bruto"]
[null,119,"Customer deposits (1)","Depósitos de clientes (*)"]
[null,120,"Loans under management","Inversión en gestión"]
[null,121,"Customer deposits under management (*)","Depósitos de clientes en gestión (*)"]
[null,122,"Mutual funds","Fondos de inversión"]
[null,123,"Other placements","Otras colocaciones"]
[null,124,"ROE (%)","ROE (%)"]
[null,125,"Efficiency ratio (%)","Ratio de eficiencia (%)"]
[null,126,"NPA ratio (%)","Tasa de mora (%)"]
[null,127,"Coverage ratio (%)","Tasa de cobertura (%)"]
[null,128,"(*) Includes collection accounts and individual annuities.","(*) Incluye cuentas de recaudación y rentas de seguros"]
[null,129,"(*) Excluding deposits and repos issued by Bancomer's Markets unit.","(*) Excluidos depósitos y repos emitidos por Mercados Bancomer."]
[null,130,"(*) Including marketable debt securities.","(*) Incluye valores negociables."]
[null,{"$f":"B132+1","v":131},"(*) In the fourth quarter of 2009, there was an extraordinary provision of 533 million euros and a 998 miliion euros ","(*) En el cuarto trimestre de 2009, dotación extraordinaria a saneamientos por importe de 533 millones de euros y cargo por el deterioro de valor del fondo de comercio "]
[null,132,"(*) Excluding deposits and repos issued by Markets unit.","(*) Excluidos depósitos y repos emitidos por Mercados."]
[null,133,"(*) In the fourth quarter of 2009, excludes an extraordinary provision of 533 million euros and a 998 miliion euros","(*) En el cuarto trimestre de 2009, no incluye dotación extraordinaria a saneamientos por importe de 533 millones de euros y cargo por el deterioro de valor del fondo de comercio"]
[null,134,". Assets sold under repurchase agreement"," . Cesiones temporales de activos"]
[null,135,"Shareholders' funds","Capital y reservas"]
[null,136,"Economic capital allocated","Dotación de capital económico"]
[null,137,"(*) Operating expenses / Gross income. Including depreciation","(*) Gastos de explotación / Margen bruto. Incluye amortizaciones"]
[null,138,"Efficiency (%) (*)","Eficiencia (%) (*)"]
[null,139,"NPA ratio (%)","Tasa de mora (%)"]
[null,140,"Coverage ratio (%)","Tasa de cobertura (%)"]
[null,141,"Branches","Oficinas"]
[null,142,"Spain","España"]
[null,143,"America","América"]
[null,144,"Mexico","   México"]
[null,145,"The United States","   Estados Unidos "]
[null,146,"Argentina","   Argentina "]
[null,147,"Colombia","   Colombia"]
[null,148,"Venezuela","   Venezuela"]
[null,149,"Peru","   Perú"]
[null,150,"Chile","   Chile "]
[null,151,"Panama","   Panamá"]
[null,152,"Paraguay","   Paraguay"]
[null,153,"Uruguay","   Uruguay"]
[null,154,"Ecuador","   Ecuador"]
[null,155,"Bolivia","   Bolivia"]
[null,156,"Rest of the world","Resto del mundo"]
[null,157,"Total","Total"]
[null,158,"Employees","Empleados"]
[null,159,"BBVA Group. Consolidated income statement excluding one-offs (*)","Grupo BBVA. Cuentas de resultados consolidadas sin singulares (*)"]
[null,160,"Provisions (net) and other gains/losses","Dotaciones a provisiones y otros resultados"]
[null,161,"Customer deposits","Depósitos de clientes"]
[null,162," . Deposits "," . Depósitos "]
[null,163,"Valuation adjustments","Ajustes por valoración"]
[null,164,"BBVA Group","Grupo BBVA"]
[null,165,"and in the fourth quarter of 2009, there was an extraordinary provision and a charge for goodwill impairment in the United States.","y en el cuarto trimestre de 2009, dotación extraordinaria a saneamientos y cargo por el deterioro del valor del fondo de comercio en Estados Unidos."]
[null,166,"charge for goodwill impairment, both before tax.","por 998 millones, ambas antes de impuestos."]
[null,{"$f":"B168+1","v":167},"(Expressed in currency/euro)","(Expresados en divisa/euro)"]
[null,168,"Mexican peso","Peso mexicano"]
[null,169,"U.S. dollar","Dólar estadounidense"]
[null,170,"Argentine peso","Peso argentino"]
[null,171,"Chilean peso","Peso chileno"]
[null,172,"Colombian peso","Peso colombiano"]
[null,173,"Peruvian new sol","Nuevo sol peruano"]
[null,174,"Venezuelan bolivar fuerte","Bolívar fuerte venezolano"]
[null,175,"Year-end exchange rates (*)","Cambios finales (*)"]
[null,176,"Average exchange rates (**)","Cambios medios (**)"]
[null,177,"(*) Used in the constant euros comparisons for the balance sheet and business activity","(*) Utilizados en el cálculo de euros constantes de los datos de balance y actividad"]
[null,178,"(**) Used in the constant euros comparisons for the profit and loss","(**) Utilizados en el cálculo de euros constantes de los datos de resultados"]
[null,179,"Jan.-Dec. 2010","Enero-Dic. 2010"]
[null,180,"∆ % on","∆% sobre "]
[null,181,"Jan.-Dec. 2009","Enero-Dic. 2009"]
[null,182,"Exchange rates","Tipos de cambio"]
[null,183,"Rest of Eurasia","Resto de Eurasia"]
[null,184,"Rest of Eurasia","Resto de Eurasia"]
[null,185,"Local business","Negocios locales"]
[null,186,"Corporate & Investment Banking","Corporate & Investment Banking"]
[null,187,"Quarterly series (*) - March 2011. Information by segments","Series trimestrales (*) - Marzo 2011. Información por segmentos"]
[null,188,"Quarterly series (*) - March 2011. Main ratios","Series trimestrales (*) - Marzo 2011. Principales ratios"]
[null,189,"Asset management, Pensions and Insurance","Gestión de activos, Pensiones y Seguros"]
[null,190,"Turkish lira","Lira turca"]
[null,191,"Yuan Chinese","Yuan chino"]
[null,192,"Quarterly series 2014-2015 ","Series trimestrales 2014-2015 "]
[null,193,"Business areas","Areas de negocio"]
[null,194,"Additional information:","Información adicional:"]
[null,195,"Consolidated income statement","Cuentas de resultados consolidadas"]
[null,196,"Consolidated balance sheet","Balances de situación consolidados"]
[null,197,"March 2011","Marzo 2011"]
[null,198,"Cost of risk (%)","Coste de riesgo (%)"]
[null,199,"Breakdown of yields and costs","Estructura de rendimientos y costes"]
[null,200,"BBVA Group","Grupo BBVA"]
[null,201,"Annex:","Anexo:"]
[null,202,"(***) The addition of Corporate & business banking businesses in all countries. Figures in current and constant euros","(***) Como suma de los negocios globales de cada geografia, Datos en Euros corrientes y costantes"]
[null,203,"1H15","1er Sem. 15"]
[null,204,"1H14","1er Sem. 14"]
[null,205,"ATM's","Cajeros Automáticos"]
[null,206,"Pension funds","Fondos de pensiones"]
[null,207," .Mortgage bonds"," .Titulos hipotecarios y cédulas territoriales"]
[null,208," .Other debt certificates"," .Otros valores negociables"]
[null,209,"Cash and balances with central banks","Caja y depósitos en bancos centrales"]
[null,210,"Financial assets and derivatives","Cartera de títulos y derivados"]
[null,211,"Loans and advances to credit institutions","Depósitos en entidades de crédito"]
[null,212,"Loans and advances to customers","Créditos a la clientela"]
[null,213,"Euros","  . Euros"]
[null,214,"Domestic","      - Residentes"]
[null,215,"Other","      - Otros"]
[null,216,"Foreign currencies","  . Moneda extranjera"]
[null,217,"Other assets","Otros activos"]
[null,218,"Total assets","Total activo"]
[null,219,"Deposits from central banks and credit institutions","Depósitos de bancos centrales y entidades de crédito"]
[null,220,"Deposits from customers","Depósitos de la clientela"]
[null,221,"Euros","  . Euros"]
[null,222,"Domestic","      - Residentes"]
[null,223,"Other","      - Otros"]
[null,224,"Foreign currencies","  . Moneda extranjera"]
[null,225,"Debt certificates and subordinated liabilities","Valores negociables y pasivos subordinados"]
[null,226,"Other liabilities","Otros pasivos"]
[null,227,"Equity","Patrimonio neto"]
[null,228,"Total liabilities and equity","Total patrimonio neto y pasivo"]
[null,229,"Net interest income/Average total assets (ATA)","Margen de intereses/activos totales medios (ATM)"]
[null,230,"(1) In the fourth quarter of 2011, there was an extraordinary provision and a charge for goodwill impairment in the United States.","(*) En 2011, en el cuarto trimestre,  cargo por el deterioro del valor del fondo de comercio en Estados Unidos. "]
[null,231,"1st Quarter","1er Trim. "]
[null,232,"2nd Quarter","2º Trim."]
[null,233,"3rd Quarter","3er Trim."]
[null,234,"4th Quarter ","4º Trim."]
[null,235,"1st Quarter","1er Trim. "]
[null,236,"2nd Quarter","2º Trim. "]
[null,237,"3rd Quarter","3er Trim. "]
[null,238,"4th Quarter","4º Trim. "]
[null,239,"% of ATA","% s/ATM"]
[null,240,"% yield/Cost","% Rdto./Coste"]
[null,241,"Adjusted(**)","Ajustes(**)"]
[null,242,"Net attributable profit (excluding results from corporate operations) (**)","Beneficio atribuido al Grupo (sin el resultado de operaciones corporativas) (**)"]
[null,243,"(Million of euros as of 30-Jun-15)"," (Millones de euros a 30-06-15)"]
[null,244,"Risk amount","Importe del riesgo"]
[null,245,"Provision","Provisiones"]
[null,246,"% Coverage over risk","%  cobertura sobre riesgo"]
[null,247,"NPL + Substandard","Dudosos más subestándar"]
[null,248,"NPL","Dudosos"]
[null,249,"Substandard","Subestándar"]
[null,250,"Foreclosed real estate and other assets","Inmuebles adjudicados y otros activos"]
[null,251,"From real estate developers","Procedentes de finalidad inmobiliaria"]
[null,252,"From dwellings","Procedentes de financiación a adquisición de vivienda"]
[null,253,"Other","Resto de activos"]
[null,254,"Subtotal","Subtotal"]
[null,255,"Performing","Riesgo vivo"]
[null,256,"With collateral","Con garantía hipotecaria"]
[null,257,"Finished properties","Edificios terminados"]
[null,258,"Construction in progress","Edificios en construcción"]
[null,259,"Land","Suelo"]
[null,260,"Without collateral and other","Sin garantía hipotecaria y otros"]
[null,261,"Real estate exposure","Exposición Inmobiliaria"]
[null,262,"Coverage of real estate exposure in Spain","Cobertura de la exposición inmobiliaria en España"]
[null,263,"Print","Imprimir"]
[null,264,"BBVA Real Estate","BBVA Real Estate"]
[null,265,"Memorandum Item: Consolidated income statement before ongoing/discounted operations (**)","Promemoria: Cuentas de resultados consolidadas antes de operaciones continuadas/interrumpidas (**)"]
[null,266,"(**) Not considering pension business in Latin America as discontinued operations","(**) Sin considerar el negocio previsional en Latinoamérica como operaciones interrumpidas"]
[null,267,"Consolidated income statement","Cuentas de resultados consolidadas"]
[null,{"$f":"B269+1","v":268},"Corporate & Investment Banking","Corporate & Investment Banking"]
[null,269,"Net income from ongoing operations","Beneficio después de impuestos de operaciones continuadas"]
[null,270,"Result from corporate operations","Resultado de operaciones corporativas"]
[null,271,"Banking business","Actividad bancaria"]
[null,272,"Banking business(*)","Actividad bancaria(*)"]
[null,273,"BBVA Real Estate(*)","BBVA Real Estate(*)"]
[null,274,"(*)  In 2012 impairment charge related to the deterioration of the real-estate sector in Spain. ","(*) En  2012, cargo por el deterioro de los activos relacionados con el negocio inmobiliario."]
[null,275,"Eurasia","Eurasia"]
[null,276,"(*) Financial statements with the assets and liabilities of the Garanti Group consolidated in proportion to the percentage of the Group's stake. ","(*)  Estados financieros con los activos y pasivos de Garanti Group integrados en la proporción correspondiente al porcentaje de participación del Grupo. "]
[null,277,"Corporate Center (*)","Centro corporativo (*)"]
[null,278,"(*) In 2012, impairment charge related to the deterioration of the real-estate sector in Spain and impact of Unnim badwill. ","(*) Ajustado del negocio previsional y abono por el badwill de Unimm."]
[null,279,"Real-estate business in Spain","Actividad inmobiliaria en España"]
[null,280,"Real-estate business in Spain(*)","Actividad inmobiliaria en España(*)"]
[null,281,"Note: Transparency scope according to Bank of Spain Circular 5/2011 dated November 30.","Nota: Perímetro de transparencia según la Circular 5/2011 del 30 de noviembre del Banco de España."]
[null,282,"(*) Adjusted based on the reinsurance operation on the individual life-risk insurance portfolio in Spain","(*) Ajustado de la operación de reaseguro sobre la cartera de vida-riesgo individual."]
[null,283,"(*) Adjusted based on the profit from the pension business.","(*) Ajustado del beneficio del negocio previsional."]
[null,284,"(*) Excluding repos and including specific marketable debt securities.","(*) No incluye las cesiones temporales de activos e incluye determinados valores negociables."]
[null,285,"(*) Excluding repos. ","(*) No incluye las cesiones temporales de activos."]
[null,286,"(*) Includes area's repos in Mexico.","(*) Incluye las cesiones temporales de activos del área en México."]
[null,287,"(*) Including all the repos.","(*) Incluye la totalidad de las cesiones temporales de activos."]
[null,288,"(**) Adjusted based on the result of real-estate activity in Spain, the profit from the pension business in Latin America, the badwill from Unnim, the reinsurance operation on the individual life-risk insurance portfolio in Spain and and of the new classification of refinanced loans.","(**) Ajustado del resultado de la actividad inmobiliaria en España, del beneficio del negocio previsional en Latinoamerica, del badwill de Unnim, de la operación de reaseguro sobre la cartera de vida-riesgo individual de España y de la nueva clasificación de los créditos refinanciados."]
[null,289,"(*) Financial statements with the revenues and expenses of the Garanti Group consolidated in proportion to the percentage of the Group's stake.","(*) Estados financieros con los ingresos y gastos de Garanti Group integrados en la proporción correspondiente al porcentaje de participación del Grupo. ","y"]
[null,290,"Consolidated income statement (*)","Cuentas de resultados consolidadas (*)"]
[null,291,"BBVA Group. Consolidated balance sheet (*)","Grupo BBVA. Balances de situación consolidados (*)"]
[null,{"$f":"B293+1","v":292},"Customer deposits under management (**)","Depósitos de clientes en gestión (**)"]
[null,{"$f":"B294+1","v":293},"Balance sheet (*)  ","Balances (*)"]
[null,{"$f":"B295+1","v":294},"(**) Excluding repos.","(**) No incluye las cesiones temporales de activos."]
[null,295,"Turkey","Turquía"]
[null,296,"Net attributable profit (excluding results from corporate operations)","Beneficio atribuido al Grupo (sin el resultado de operaciones corporativas)"]
[null,297,"(*) Including repos.","(*) Incluye las cesiones temporales de activos."]
[null,{"$f":"B299+1","v":298},"(*) Excluding repos.","(*) No incluye las cesiones temporales de activos."]
[null,{"$f":"B300+1","v":299},"Loans under management (*)","Inversión en gestión (*)"]
[null,{"$f":"B301+1","v":300},". Debt securities",". Valores representativos de deuda"]
[null,301,"Banking activity in Spain","Actividad bancaria en España"]
[null,302,"Brazil","Brasil"]
[null,303,"BBVA Group without Venezuela","Grupo BBVA sin Venezuela "]
[null,304,"Income statement (*)","Cuentas de resultados (*)"]
[null,305,"South America without Venezuela","América del Sur sin Venezuela"]
[null,306,"Yields and costs","Rendimientos y costes"]